Author sxt1001
Recipients Asheesh.Laroia, serhiy.storchaka, shihai1991, sxt1001
Date 2021-10-12.13:37:47
SpamBayes Score -1.0
Marked as misclassified Yes
Message-id <1634045867.87.0.955416673386.issue45444@roundup.psfhosted.org>
In-reply-to
Content
When I was building Python3,the test case test. Test_ concurrent_ Futures.threadpoolwaittests always fails. The error message is as follows:

[ 1680s] test_zero_timeout (test.test_concurrent_futures.ProcessPoolForkAsCompletedTest) ... 2.12s ok
[ 1680s] test_crash_at_task_unpickle (test.test_concurrent_futures.ProcessPoolForkExecutorDeadlockTest) ... 83.82s FAIL
[ 1680s] test_crash_during_func_exec_on_worker (test.test_concurrent_futures.ProcessPoolForkExecutorDeadlockTest) ... 80.08s FAIL
[ 1680s] test_crash_during_result_pickle_on_worker (test.test_concurrent_futures.ProcessPoolForkExecutorDeadlockTest) ... 77.34s FAIL
[ 1680s] test_error_at_task_pickle (test.test_concurrent_futures.ProcessPoolForkExecutorDeadlockTest) ... 0.12s ok



[ 1680s] ======================================================================
[ 1680s] FAIL: test_crash_at_task_unpickle (test.test_concurrent_futures.ProcessPoolForkExecutorDeadlockTest)
[ 1680s] ----------------------------------------------------------------------
[ 1680s] Traceback (most recent call last):
[ 1680s]   File "/home/abuild/rpmbuild/BUILD/Python-3.10.0/Lib/test/test_concurrent_futures.py", line 1133, in _check_crash
[ 1680s]     res.result(timeout=self.TIMEOUT)
[ 1680s]   File "/home/abuild/rpmbuild/BUILD/Python-3.10.0/Lib/concurrent/futures/_base.py", line 447, in result
[ 1680s]     raise TimeoutError()
[ 1680s] concurrent.futures._base.TimeoutError
[ 1680s]
[ 1680s] During handling of the above exception, another exception occurred:
[ 1680s]
[ 1680s] Traceback (most recent call last):
[ 1680s]   File "/home/abuild/rpmbuild/BUILD/Python-3.10.0/Lib/test/test_concurrent_futures.py", line 1155, in test_crash_at_task_unpickle
[ 1680s]     self._check_crash(BrokenProcessPool, id, CrashAtUnpickle())
[ 1680s]   File "/home/abuild/rpmbuild/BUILD/Python-3.10.0/Lib/test/test_concurrent_futures.py", line 1137, in _check_crash
[ 1680s]     self._fail_on_deadlock(executor)
[ 1680s]   File "/home/abuild/rpmbuild/BUILD/Python-3.10.0/Lib/test/test_concurrent_futures.py", line 1114, in _fail_on_deadlock
[ 1680s]     self.fail(f"Executor deadlock:\n\n{tb}")
[ 1680s] AssertionError: Executor deadlock:
[ 1680s]
[ 1680s] Thread 0x00007f6389d6f700 (most recent call first):
[ 1680s]   File "/home/abuild/rpmbuild/BUILD/Python-3.10.0/Lib/threading.py", line 320 in wait
[ 1680s]   File "/home/abuild/rpmbuild/BUILD/Python-3.10.0/Lib/multiprocessing/queues.py", line 233 in _feed
[ 1680s]   File "/home/abuild/rpmbuild/BUILD/Python-3.10.0/Lib/threading.py", line 946 in run
[ 1680s]   File "/home/abuild/rpmbuild/BUILD/Python-3.10.0/Lib/threading.py", line 1009 in _bootstrap_inner
[ 1680s]   File "/home/abuild/rpmbuild/BUILD/Python-3.10.0/Lib/threading.py", line 966 in _bootstrap
[ 1680s]
[ 1680s] Thread 0x00007f638a570700 (most recent call first):
[ 1680s]   File "/home/abuild/rpmbuild/BUILD/Python-3.10.0/Lib/selectors.py", line 416 in select
[ 1680s]   File "/home/abuild/rpmbuild/BUILD/Python-3.10.0/Lib/multiprocessing/connection.py", line 936 in wait
[ 1680s]   File "/home/abuild/rpmbuild/BUILD/Python-3.10.0/Lib/concurrent/futures/process.py", line 377 in wait_result_broken_or_wakeup
[ 1680s]   File "/home/abuild/rpmbuild/BUILD/Python-3.10.0/Lib/concurrent/futures/process.py", line 317 in run
[ 1680s]   File "/home/abuild/rpmbuild/BUILD/Python-3.10.0/Lib/threading.py", line 1009 in _bootstrap_inner
[ 1680s]   File "/home/abuild/rpmbuild/BUILD/Python-3.10.0/Lib/threading.py", line 966 in _bootstrap
[ 1680s]
[ 1680s] Current thread 0x00007f63982a1740 (most recent call first):
[ 1680s]   File "/home/abuild/rpmbuild/BUILD/Python-3.10.0/Lib/test/test_concurrent_futures.py", line 1105 in _fail_on_deadlock
[ 1680s]   File "/home/abuild/rpmbuild/BUILD/Python-3.10.0/Lib/test/test_concurrent_futures.py", line 1137 in _check_crash
[ 1680s]   File "/home/abuild/rpmbuild/BUILD/Python-3.10.0/Lib/test/test_concurrent_futures.py", line 1155 in test_crash_at_task_unpickle
[ 1680s]   File "/home/abuild/rpmbuild/BUILD/Python-3.10.0/Lib/unittest/case.py", line 549 in _callTestMethod
[ 1680s]   File "/home/abuild/rpmbuild/BUILD/Python-3.10.0/Lib/unittest/case.py", line 591 in run
[ 1680s]   File "/home/abuild/rpmbuild/BUILD/Python-3.10.0/Lib/unittest/case.py", line 650 in __call__
[ 1680s]   File "/home/abuild/rpmbuild/BUILD/Python-3.10.0/Lib/unittest/suite.py", line 122 in run
[ 1680s]   File "/home/abuild/rpmbuild/BUILD/Python-3.10.0/Lib/unittest/suite.py", line 84 in __call__
[ 1680s]   File "/home/abuild/rpmbuild/BUILD/Python-3.10.0/Lib/unittest/suite.py", line 122 in run
[ 1680s]   File "/home/abuild/rpmbuild/BUILD/Python-3.10.0/Lib/unittest/suite.py", line 84 in __call__
[ 1680s]   File "/home/abuild/rpmbuild/BUILD/Python-3.10.0/Lib/unittest/suite.py", line 122 in run
[ 1680s]   File "/home/abuild/rpmbuild/BUILD/Python-3.10.0/Lib/unittest/suite.py", line 84 in __call__
[ 1680s]   File "/home/abuild/rpmbuild/BUILD/Python-3.10.0/Lib/unittest/runner.py", line 176 in run
[ 1680s]   File "/home/abuild/rpmbuild/BUILD/Python-3.10.0/Lib/test/support/__init__.py", line 990 in _run_suite
[ 1680s]   File "/home/abuild/rpmbuild/BUILD/Python-3.10.0/Lib/test/support/__init__.py", line 1115 in run_unittest
[ 1680s]   File "/home/abuild/rpmbuild/BUILD/Python-3.10.0/Lib/test/libregrtest/runtest.py", line 261 in _test_module
[ 1680s]   File "/home/abuild/rpmbuild/BUILD/Python-3.10.0/Lib/test/libregrtest/runtest.py", line 297 in _runtest_inner2
[ 1680s]   File "/home/abuild/rpmbuild/BUILD/Python-3.10.0/Lib/test/libregrtest/runtest.py", line 335 in _runtest_inner
[ 1680s]   File "/home/abuild/rpmbuild/BUILD/Python-3.10.0/Lib/test/libregrtest/runtest.py", line 202 in _runtest
[ 1680s]   File "/home/abuild/rpmbuild/BUILD/Python-3.10.0/Lib/test/libregrtest/runtest.py", line 245 in runtest
[ 1680s]   File "/home/abuild/rpmbuild/BUILD/Python-3.10.0/Lib/test/libregrtest/runtest_mp.py", line 83 in run_tests_worker
[ 1680s]   File "/home/abuild/rpmbuild/BUILD/Python-3.10.0/Lib/test/libregrtest/main.py", line 678 in _main
[ 1680s]   File "/home/abuild/rpmbuild/BUILD/Python-3.10.0/Lib/test/libregrtest/main.py", line 658 in main
[ 1680s]   File "/home/abuild/rpmbuild/BUILD/Python-3.10.0/Lib/test/libregrtest/main.py", line 736 in main
[ 1680s]   File "/home/abuild/rpmbuild/BUILD/Python-3.10.0/Lib/test/regrtest.py", line 43 in _main
[ 1680s]   File "/home/abuild/rpmbuild/BUILD/Python-3.10.0/Lib/test/regrtest.py", line 47 in <module>
[ 1680s]   File "/home/abuild/rpmbuild/BUILD/Python-3.10.0/Lib/runpy.py", line 86 in _run_code
[ 1680s]   File "/home/abuild/rpmbuild/BUILD/Python-3.10.0/Lib/runpy.py", line 196 in _run_module_as_main
[ 1680s]
[ 1680s]
[ 1680s] ======================================================================
[ 1680s] FAIL: test_crash_during_func_exec_on_worker (test.test_concurrent_futures.ProcessPoolForkExecutorDeadlockTest)
[ 1680s] ----------------------------------------------------------------------
[ 1680s] Traceback (most recent call last):
[ 1680s]   File "/home/abuild/rpmbuild/BUILD/Python-3.10.0/Lib/test/test_concurrent_futures.py", line 1133, in _check_crash
[ 1680s]     res.result(timeout=self.TIMEOUT)
[ 1680s]   File "/home/abuild/rpmbuild/BUILD/Python-3.10.0/Lib/concurrent/futures/_base.py", line 447, in result
[ 1680s]     raise TimeoutError()
[ 1680s] concurrent.futures._base.TimeoutError
[ 1680s]
[ 1680s] During handling of the above exception, another exception occurred:
[ 1680s]
[ 1680s] Traceback (most recent call last):
[ 1680s]   File "/home/abuild/rpmbuild/BUILD/Python-3.10.0/Lib/test/test_concurrent_futures.py", line 1159, in test_crash_during_func_exec_on_worker
[ 1680s]     self._check_crash(BrokenProcessPool, _crash)
[ 1680s]   File "/home/abuild/rpmbuild/BUILD/Python-3.10.0/Lib/test/test_concurrent_futures.py", line 1137, in _check_crash
[ 1680s]     self._fail_on_deadlock(executor)
[ 1680s]   File "/home/abuild/rpmbuild/BUILD/Python-3.10.0/Lib/test/test_concurrent_futures.py", line 1114, in _fail_on_deadlock
[ 1680s]     self.fail(f"Executor deadlock:\n\n{tb}")
[ 1680s] AssertionError: Executor deadlock:
[ 1680s]
[ 1680s] Thread 0x00007f6389d6f700 (most recent call first):
[ 1680s]   File "/home/abuild/rpmbuild/BUILD/Python-3.10.0/Lib/threading.py", line 320 in wait
[ 1680s]   File "/home/abuild/rpmbuild/BUILD/Python-3.10.0/Lib/multiprocessing/queues.py", line 233 in _feed
[ 1680s]   File "/home/abuild/rpmbuild/BUILD/Python-3.10.0/Lib/threading.py", line 946 in run
[ 1680s]   File "/home/abuild/rpmbuild/BUILD/Python-3.10.0/Lib/threading.py", line 1009 in _bootstrap_inner
[ 1680s]   File "/home/abuild/rpmbuild/BUILD/Python-3.10.0/Lib/threading.py", line 966 in _bootstrap
[ 1680s]
[ 1680s] Thread 0x00007f638a570700 (most recent call first):
[ 1680s]   File "/home/abuild/rpmbuild/BUILD/Python-3.10.0/Lib/selectors.py", line 416 in select
[ 1680s]   File "/home/abuild/rpmbuild/BUILD/Python-3.10.0/Lib/multiprocessing/connection.py", line 936 in wait
[ 1680s]   File "/home/abuild/rpmbuild/BUILD/Python-3.10.0/Lib/concurrent/futures/process.py", line 377 in wait_result_broken_or_wakeup
[ 1680s]   File "/home/abuild/rpmbuild/BUILD/Python-3.10.0/Lib/concurrent/futures/process.py", line 317 in run
[ 1680s]   File "/home/abuild/rpmbuild/BUILD/Python-3.10.0/Lib/threading.py", line 1009 in _bootstrap_inner
[ 1680s]   File "/home/abuild/rpmbuild/BUILD/Python-3.10.0/Lib/threading.py", line 966 in _bootstrap
[ 1680s]
[ 1680s] Current thread 0x00007f63982a1740 (most recent call first):
[ 1680s]   File "/home/abuild/rpmbuild/BUILD/Python-3.10.0/Lib/test/test_concurrent_futures.py", line 1105 in _fail_on_deadlock
[ 1680s]   File "/home/abuild/rpmbuild/BUILD/Python-3.10.0/Lib/test/test_concurrent_futures.py", line 1137 in _check_crash
[ 1680s]   File "/home/abuild/rpmbuild/BUILD/Python-3.10.0/Lib/test/test_concurrent_futures.py", line 1159 in test_crash_during_func_exec_on_worker
[ 1680s]   File "/home/abuild/rpmbuild/BUILD/Python-3.10.0/Lib/unittest/case.py", line 549 in _callTestMethod
[ 1680s]   File "/home/abuild/rpmbuild/BUILD/Python-3.10.0/Lib/unittest/case.py", line 591 in run
[ 1680s]   File "/home/abuild/rpmbuild/BUILD/Python-3.10.0/Lib/unittest/case.py", line 650 in __call__
[ 1680s]   File "/home/abuild/rpmbuild/BUILD/Python-3.10.0/Lib/unittest/suite.py", line 122 in run
[ 1680s]   File "/home/abuild/rpmbuild/BUILD/Python-3.10.0/Lib/unittest/suite.py", line 84 in __call__
[ 1680s]   File "/home/abuild/rpmbuild/BUILD/Python-3.10.0/Lib/unittest/suite.py", line 122 in run
[ 1680s]   File "/home/abuild/rpmbuild/BUILD/Python-3.10.0/Lib/unittest/suite.py", line 84 in __call__
[ 1680s]   File "/home/abuild/rpmbuild/BUILD/Python-3.10.0/Lib/unittest/suite.py", line 122 in run
[ 1680s]   File "/home/abuild/rpmbuild/BUILD/Python-3.10.0/Lib/unittest/suite.py", line 84 in __call__
[ 1680s]   File "/home/abuild/rpmbuild/BUILD/Python-3.10.0/Lib/unittest/runner.py", line 176 in run
[ 1680s]   File "/home/abuild/rpmbuild/BUILD/Python-3.10.0/Lib/test/support/__init__.py", line 990 in _run_suite
[ 1680s]   File "/home/abuild/rpmbuild/BUILD/Python-3.10.0/Lib/test/support/__init__.py", line 1115 in run_unittest
[ 1680s]   File "/home/abuild/rpmbuild/BUILD/Python-3.10.0/Lib/test/libregrtest/runtest.py", line 261 in _test_module
[ 1680s]   File "/home/abuild/rpmbuild/BUILD/Python-3.10.0/Lib/test/libregrtest/runtest.py", line 297 in _runtest_inner2
[ 1680s]   File "/home/abuild/rpmbuild/BUILD/Python-3.10.0/Lib/test/libregrtest/runtest.py", line 335 in _runtest_inner
[ 1680s]   File "/home/abuild/rpmbuild/BUILD/Python-3.10.0/Lib/test/libregrtest/runtest.py", line 202 in _runtest
[ 1680s]   File "/home/abuild/rpmbuild/BUILD/Python-3.10.0/Lib/test/libregrtest/runtest.py", line 245 in runtest
[ 1680s]   File "/home/abuild/rpmbuild/BUILD/Python-3.10.0/Lib/test/libregrtest/runtest_mp.py", line 83 in run_tests_worker
[ 1680s]   File "/home/abuild/rpmbuild/BUILD/Python-3.10.0/Lib/test/libregrtest/main.py", line 678 in _main
[ 1680s]   File "/home/abuild/rpmbuild/BUILD/Python-3.10.0/Lib/test/libregrtest/main.py", line 658 in main
[ 1680s]   File "/home/abuild/rpmbuild/BUILD/Python-3.10.0/Lib/test/libregrtest/main.py", line 736 in main
[ 1680s]   File "/home/abuild/rpmbuild/BUILD/Python-3.10.0/Lib/test/regrtest.py", line 43 in _main
[ 1680s]   File "/home/abuild/rpmbuild/BUILD/Python-3.10.0/Lib/test/regrtest.py", line 47 in <module>
[ 1680s]   File "/home/abuild/rpmbuild/BUILD/Python-3.10.0/Lib/runpy.py", line 86 in _run_code
[ 1680s]   File "/home/abuild/rpmbuild/BUILD/Python-3.10.0/Lib/runpy.py", line 196 in _run_module_as_main
[ 1680s]
[ 1680s]
[ 1680s] ======================================================================
[ 1680s] FAIL: test_crash_during_result_pickle_on_worker (test.test_concurrent_futures.ProcessPoolForkExecutorDeadlockTest)
[ 1680s] ----------------------------------------------------------------------
[ 1680s] Traceback (most recent call last):
[ 1680s]   File "/home/abuild/rpmbuild/BUILD/Python-3.10.0/Lib/test/test_concurrent_futures.py", line 1133, in _check_crash
[ 1680s]     res.result(timeout=self.TIMEOUT)
[ 1680s]   File "/home/abuild/rpmbuild/BUILD/Python-3.10.0/Lib/concurrent/futures/_base.py", line 447, in result
[ 1680s]     raise TimeoutError()
[ 1680s] concurrent.futures._base.TimeoutError
[ 1680s]
[ 1680s] During handling of the above exception, another exception occurred:
[ 1680s]
[ 1680s] Traceback (most recent call last):
[ 1680s]   File "/home/abuild/rpmbuild/BUILD/Python-3.10.0/Lib/test/test_concurrent_futures.py", line 1172, in test_crash_during_result_pickle_on_worker
[ 1680s]     self._check_crash(BrokenProcessPool, _return_instance, CrashAtPickle)
[ 1680s]   File "/home/abuild/rpmbuild/BUILD/Python-3.10.0/Lib/test/test_concurrent_futures.py", line 1137, in _check_crash
[ 1680s]     self._fail_on_deadlock(executor)
[ 1680s]   File "/home/abuild/rpmbuild/BUILD/Python-3.10.0/Lib/test/test_concurrent_futures.py", line 1114, in _fail_on_deadlock
[ 1680s]     self.fail(f"Executor deadlock:\n\n{tb}")
[ 1680s] AssertionError: Executor deadlock:
[ 1680s]
[ 1680s] Thread 0x00007f6389d6f700 (most recent call first):
[ 1680s]   File "/home/abuild/rpmbuild/BUILD/Python-3.10.0/Lib/threading.py", line 320 in wait
[ 1680s]   File "/home/abuild/rpmbuild/BUILD/Python-3.10.0/Lib/multiprocessing/queues.py", line 233 in _feed
[ 1680s]   File "/home/abuild/rpmbuild/BUILD/Python-3.10.0/Lib/threading.py", line 946 in run
[ 1680s]   File "/home/abuild/rpmbuild/BUILD/Python-3.10.0/Lib/threading.py", line 1009 in _bootstrap_inner
[ 1680s]   File "/home/abuild/rpmbuild/BUILD/Python-3.10.0/Lib/threading.py", line 966 in _bootstrap
[ 1680s]
[ 1680s] Thread 0x00007f638a570700 (most recent call first):
[ 1680s]   File "/home/abuild/rpmbuild/BUILD/Python-3.10.0/Lib/selectors.py", line 416 in select
[ 1680s]   File "/home/abuild/rpmbuild/BUILD/Python-3.10.0/Lib/multiprocessing/connection.py", line 936 in wait
[ 1680s]   File "/home/abuild/rpmbuild/BUILD/Python-3.10.0/Lib/concurrent/futures/process.py", line 377 in wait_result_broken_or_wakeup
[ 1680s]   File "/home/abuild/rpmbuild/BUILD/Python-3.10.0/Lib/concurrent/futures/process.py", line 317 in run
[ 1680s]   File "/home/abuild/rpmbuild/BUILD/Python-3.10.0/Lib/threading.py", line 1009 in _bootstrap_inner
[ 1680s]   File "/home/abuild/rpmbuild/BUILD/Python-3.10.0/Lib/threading.py", line 966 in _bootstrap
[ 1680s]
[ 1680s] Current thread 0x00007f63982a1740 (most recent call first):
[ 1680s]   File "/home/abuild/rpmbuild/BUILD/Python-3.10.0/Lib/test/test_concurrent_futures.py", line 1105 in _fail_on_deadlock
[ 1680s]   File "/home/abuild/rpmbuild/BUILD/Python-3.10.0/Lib/test/test_concurrent_futures.py", line 1137 in _check_crash
[ 1680s]   File "/home/abuild/rpmbuild/BUILD/Python-3.10.0/Lib/test/test_concurrent_futures.py", line 1172 in test_crash_during_result_pickle_on_worker
[ 1680s]   File "/home/abuild/rpmbuild/BUILD/Python-3.10.0/Lib/unittest/case.py", line 549 in _callTestMethod
[ 1680s]   File "/home/abuild/rpmbuild/BUILD/Python-3.10.0/Lib/unittest/case.py", line 591 in run
[ 1680s]   File "/home/abuild/rpmbuild/BUILD/Python-3.10.0/Lib/unittest/case.py", line 650 in __call__
[ 1680s]   File "/home/abuild/rpmbuild/BUILD/Python-3.10.0/Lib/unittest/suite.py", line 122 in run
[ 1680s]   File "/home/abuild/rpmbuild/BUILD/Python-3.10.0/Lib/unittest/suite.py", line 84 in __call__
[ 1680s]   File "/home/abuild/rpmbuild/BUILD/Python-3.10.0/Lib/unittest/suite.py", line 122 in run
[ 1680s]   File "/home/abuild/rpmbuild/BUILD/Python-3.10.0/Lib/unittest/suite.py", line 84 in __call__
[ 1680s]   File "/home/abuild/rpmbuild/BUILD/Python-3.10.0/Lib/unittest/suite.py", line 122 in run
[ 1680s]   File "/home/abuild/rpmbuild/BUILD/Python-3.10.0/Lib/unittest/suite.py", line 84 in __call__
[ 1680s]   File "/home/abuild/rpmbuild/BUILD/Python-3.10.0/Lib/unittest/runner.py", line 176 in run
[ 1680s]   File "/home/abuild/rpmbuild/BUILD/Python-3.10.0/Lib/test/support/__init__.py", line 990 in _run_suite
[ 1680s]   File "/home/abuild/rpmbuild/BUILD/Python-3.10.0/Lib/test/support/__init__.py", line 1115 in run_unittest
[ 1680s]   File "/home/abuild/rpmbuild/BUILD/Python-3.10.0/Lib/test/libregrtest/runtest.py", line 261 in _test_module
[ 1680s]   File "/home/abuild/rpmbuild/BUILD/Python-3.10.0/Lib/test/libregrtest/runtest.py", line 297 in _runtest_inner2
[ 1680s]   File "/home/abuild/rpmbuild/BUILD/Python-3.10.0/Lib/test/libregrtest/runtest.py", line 335 in _runtest_inner
[ 1680s]   File "/home/abuild/rpmbuild/BUILD/Python-3.10.0/Lib/test/libregrtest/runtest.py", line 202 in _runtest
[ 1680s]   File "/home/abuild/rpmbuild/BUILD/Python-3.10.0/Lib/test/libregrtest/runtest.py", line 245 in runtest
[ 1680s]   File "/home/abuild/rpmbuild/BUILD/Python-3.10.0/Lib/test/libregrtest/runtest_mp.py", line 83 in run_tests_worker
[ 1680s]   File "/home/abuild/rpmbuild/BUILD/Python-3.10.0/Lib/test/libregrtest/main.py", line 678 in _main
[ 1680s]   File "/home/abuild/rpmbuild/BUILD/Python-3.10.0/Lib/test/libregrtest/main.py", line 658 in main
[ 1680s]   File "/home/abuild/rpmbuild/BUILD/Python-3.10.0/Lib/test/libregrtest/main.py", line 736 in main
[ 1680s]   File "/home/abuild/rpmbuild/BUILD/Python-3.10.0/Lib/test/regrtest.py", line 43 in _main
[ 1680s]   File "/home/abuild/rpmbuild/BUILD/Python-3.10.0/Lib/test/regrtest.py", line 47 in <module>
[ 1680s]   File "/home/abuild/rpmbuild/BUILD/Python-3.10.0/Lib/runpy.py", line 86 in _run_code
[ 1680s]   File "/home/abuild/rpmbuild/BUILD/Python-3.10.0/Lib/runpy.py", line 196 in _run_module_as_main
[ 1680s]
[ 1680s]
[ 1680s] ======================================================================
[ 1680s] FAIL: test_crash_at_task_unpickle (test.test_concurrent_futures.ProcessPoolForkserverExecutorDeadlockTest)
[ 1680s] ----------------------------------------------------------------------
[ 1680s] Traceback (most recent call last):
[ 1680s]   File "/home/abuild/rpmbuild/BUILD/Python-3.10.0/Lib/test/test_concurrent_futures.py", line 1133, in _check_crash
[ 1680s]     res.result(timeout=self.TIMEOUT)
[ 1680s]   File "/home/abuild/rpmbuild/BUILD/Python-3.10.0/Lib/concurrent/futures/_base.py", line 447, in result
[ 1680s]     raise TimeoutError()
[ 1680s] concurrent.futures._base.TimeoutError
[ 1680s]
[ 1680s] During handling of the above exception, another exception occurred:
[ 1680s]
[ 1680s] Traceback (most recent call last):
[ 1680s]   File "/home/abuild/rpmbuild/BUILD/Python-3.10.0/Lib/test/test_concurrent_futures.py", line 1155, in test_crash_at_task_unpickle
[ 1680s]     self._check_crash(BrokenProcessPool, id, CrashAtUnpickle())
[ 1680s]   File "/home/abuild/rpmbuild/BUILD/Python-3.10.0/Lib/test/test_concurrent_futures.py", line 1137, in _check_crash
[ 1680s]     self._fail_on_deadlock(executor)
[ 1680s]   File "/home/abuild/rpmbuild/BUILD/Python-3.10.0/Lib/test/test_concurrent_futures.py", line 1114, in _fail_on_deadlock
[ 1680s]     self.fail(f"Executor deadlock:\n\n{tb}")
[ 1680s] AssertionError: Executor deadlock:
[ 1680s]
[ 1680s] Thread 0x00007f6389d6f700 (most recent call first):
[ 1680s]   File "/home/abuild/rpmbuild/BUILD/Python-3.10.0/Lib/threading.py", line 320 in wait
[ 1680s]   File "/home/abuild/rpmbuild/BUILD/Python-3.10.0/Lib/multiprocessing/queues.py", line 233 in _feed
[ 1680s]   File "/home/abuild/rpmbuild/BUILD/Python-3.10.0/Lib/threading.py", line 946 in run
[ 1680s]   File "/home/abuild/rpmbuild/BUILD/Python-3.10.0/Lib/threading.py", line 1009 in _bootstrap_inner
[ 1680s]   File "/home/abuild/rpmbuild/BUILD/Python-3.10.0/Lib/threading.py", line 966 in _bootstrap
[ 1680s]
[ 1680s] Thread 0x00007f638a570700 (most recent call first):
[ 1680s]   File "/home/abuild/rpmbuild/BUILD/Python-3.10.0/Lib/selectors.py", line 416 in select
[ 1680s]   File "/home/abuild/rpmbuild/BUILD/Python-3.10.0/Lib/multiprocessing/connection.py", line 936 in wait
[ 1680s]   File "/home/abuild/rpmbuild/BUILD/Python-3.10.0/Lib/concurrent/futures/process.py", line 377 in wait_result_broken_or_wakeup
[ 1680s]   File "/home/abuild/rpmbuild/BUILD/Python-3.10.0/Lib/concurrent/futures/process.py", line 317 in run
[ 1680s]   File "/home/abuild/rpmbuild/BUILD/Python-3.10.0/Lib/threading.py", line 1009 in _bootstrap_inner
[ 1680s]   File "/home/abuild/rpmbuild/BUILD/Python-3.10.0/Lib/threading.py", line 966 in _bootstrap
[ 1680s]
[ 1680s] Current thread 0x00007f63982a1740 (most recent call first):
[ 1680s]   File "/home/abuild/rpmbuild/BUILD/Python-3.10.0/Lib/test/test_concurrent_futures.py", line 1105 in _fail_on_deadlock
[ 1680s]   File "/home/abuild/rpmbuild/BUILD/Python-3.10.0/Lib/test/test_concurrent_futures.py", line 1137 in _check_crash
[ 1680s]   File "/home/abuild/rpmbuild/BUILD/Python-3.10.0/Lib/test/test_concurrent_futures.py", line 1155 in test_crash_at_task_unpickle
[ 1680s]   File "/home/abuild/rpmbuild/BUILD/Python-3.10.0/Lib/unittest/case.py", line 549 in _callTestMethod
[ 1680s]   File "/home/abuild/rpmbuild/BUILD/Python-3.10.0/Lib/unittest/case.py", line 591 in run
[ 1680s]   File "/home/abuild/rpmbuild/BUILD/Python-3.10.0/Lib/unittest/case.py", line 650 in __call__
[ 1680s]   File "/home/abuild/rpmbuild/BUILD/Python-3.10.0/Lib/unittest/suite.py", line 122 in run
[ 1680s]   File "/home/abuild/rpmbuild/BUILD/Python-3.10.0/Lib/unittest/suite.py", line 84 in __call__
[ 1680s]   File "/home/abuild/rpmbuild/BUILD/Python-3.10.0/Lib/unittest/suite.py", line 122 in run
[ 1680s]   File "/home/abuild/rpmbuild/BUILD/Python-3.10.0/Lib/unittest/suite.py", line 84 in __call__
[ 1680s]   File "/home/abuild/rpmbuild/BUILD/Python-3.10.0/Lib/unittest/suite.py", line 122 in run
[ 1680s]   File "/home/abuild/rpmbuild/BUILD/Python-3.10.0/Lib/unittest/suite.py", line 84 in __call__
[ 1680s]   File "/home/abuild/rpmbuild/BUILD/Python-3.10.0/Lib/unittest/runner.py", line 176 in run
[ 1680s]   File "/home/abuild/rpmbuild/BUILD/Python-3.10.0/Lib/test/support/__init__.py", line 990 in _run_suite
[ 1680s]   File "/home/abuild/rpmbuild/BUILD/Python-3.10.0/Lib/test/support/__init__.py", line 1115 in run_unittest
[ 1680s]   File "/home/abuild/rpmbuild/BUILD/Python-3.10.0/Lib/test/libregrtest/runtest.py", line 261 in _test_module
[ 1680s]   File "/home/abuild/rpmbuild/BUILD/Python-3.10.0/Lib/test/libregrtest/runtest.py", line 297 in _runtest_inner2
[ 1680s]   File "/home/abuild/rpmbuild/BUILD/Python-3.10.0/Lib/test/libregrtest/runtest.py", line 335 in _runtest_inner
[ 1680s]   File "/home/abuild/rpmbuild/BUILD/Python-3.10.0/Lib/test/libregrtest/runtest.py", line 202 in _runtest
[ 1680s]   File "/home/abuild/rpmbuild/BUILD/Python-3.10.0/Lib/test/libregrtest/runtest.py", line 245 in runtest
[ 1680s]   File "/home/abuild/rpmbuild/BUILD/Python-3.10.0/Lib/test/libregrtest/runtest_mp.py", line 83 in run_tests_worker
[ 1680s]   File "/home/abuild/rpmbuild/BUILD/Python-3.10.0/Lib/test/libregrtest/main.py", line 678 in _main
[ 1680s]   File "/home/abuild/rpmbuild/BUILD/Python-3.10.0/Lib/test/libregrtest/main.py", line 658 in main
[ 1680s]   File "/home/abuild/rpmbuild/BUILD/Python-3.10.0/Lib/test/libregrtest/main.py", line 736 in main
[ 1680s]   File "/home/abuild/rpmbuild/BUILD/Python-3.10.0/Lib/test/regrtest.py", line 43 in _main
[ 1680s]   File "/home/abuild/rpmbuild/BUILD/Python-3.10.0/Lib/test/regrtest.py", line 47 in <module>
[ 1680s]   File "/home/abuild/rpmbuild/BUILD/Python-3.10.0/Lib/runpy.py", line 86 in _run_code
[ 1680s]   File "/home/abuild/rpmbuild/BUILD/Python-3.10.0/Lib/runpy.py", line 196 in _run_module_as_main
[ 1680s]
[ 1680s]
[ 1680s] ======================================================================
[ 1680s] FAIL: test_crash_during_func_exec_on_worker (test.test_concurrent_futures.ProcessPoolForkserverExecutorDeadlockTest)
[ 1680s] ----------------------------------------------------------------------
[ 1680s] Traceback (most recent call last):
[ 1680s]   File "/home/abuild/rpmbuild/BUILD/Python-3.10.0/Lib/test/test_concurrent_futures.py", line 1133, in _check_crash
[ 1680s]     res.result(timeout=self.TIMEOUT)
[ 1680s]   File "/home/abuild/rpmbuild/BUILD/Python-3.10.0/Lib/concurrent/futures/_base.py", line 447, in result
[ 1680s]     raise TimeoutError()
[ 1680s] concurrent.futures._base.TimeoutError
[ 1680s]
[ 1680s] During handling of the above exception, another exception occurred:
[ 1680s]
[ 1680s] Traceback (most recent call last):
[ 1680s]   File "/home/abuild/rpmbuild/BUILD/Python-3.10.0/Lib/test/test_concurrent_futures.py", line 1159, in test_crash_during_func_exec_on_worker
[ 1680s]     self._check_crash(BrokenProcessPool, _crash)
[ 1680s]   File "/home/abuild/rpmbuild/BUILD/Python-3.10.0/Lib/test/test_concurrent_futures.py", line 1137, in _check_crash
[ 1680s]     self._fail_on_deadlock(executor)
[ 1680s]   File "/home/abuild/rpmbuild/BUILD/Python-3.10.0/Lib/test/test_concurrent_futures.py", line 1114, in _fail_on_deadlock
[ 1680s]     self.fail(f"Executor deadlock:\n\n{tb}")
[ 1680s] AssertionError: Executor deadlock:
[ 1680s]
[ 1680s] Thread 0x00007f6389d6f700 (most recent call first):
[ 1680s]   File "/home/abuild/rpmbuild/BUILD/Python-3.10.0/Lib/threading.py", line 320 in wait
[ 1680s]   File "/home/abuild/rpmbuild/BUILD/Python-3.10.0/Lib/multiprocessing/queues.py", line 233 in _feed
[ 1680s]   File "/home/abuild/rpmbuild/BUILD/Python-3.10.0/Lib/threading.py", line 946 in run
[ 1680s]   File "/home/abuild/rpmbuild/BUILD/Python-3.10.0/Lib/threading.py", line 1009 in _bootstrap_inner
[ 1680s]   File "/home/abuild/rpmbuild/BUILD/Python-3.10.0/Lib/threading.py", line 966 in _bootstrap
[ 1680s]
[ 1680s] Thread 0x00007f638a570700 (most recent call first):
[ 1680s]   File "/home/abuild/rpmbuild/BUILD/Python-3.10.0/Lib/selectors.py", line 416 in select
[ 1680s]   File "/home/abuild/rpmbuild/BUILD/Python-3.10.0/Lib/multiprocessing/connection.py", line 936 in wait
[ 1680s]   File "/home/abuild/rpmbuild/BUILD/Python-3.10.0/Lib/concurrent/futures/process.py", line 377 in wait_result_broken_or_wakeup
[ 1680s]   File "/home/abuild/rpmbuild/BUILD/Python-3.10.0/Lib/concurrent/futures/process.py", line 317 in run
[ 1680s]   File "/home/abuild/rpmbuild/BUILD/Python-3.10.0/Lib/threading.py", line 1009 in _bootstrap_inner
[ 1680s]   File "/home/abuild/rpmbuild/BUILD/Python-3.10.0/Lib/threading.py", line 966 in _bootstrap
[ 1680s]
[ 1680s] Current thread 0x00007f63982a1740 (most recent call first):
[ 1680s]   File "/home/abuild/rpmbuild/BUILD/Python-3.10.0/Lib/test/test_concurrent_futures.py", line 1105 in _fail_on_deadlock
[ 1680s]   File "/home/abuild/rpmbuild/BUILD/Python-3.10.0/Lib/test/test_concurrent_futures.py", line 1137 in _check_crash
[ 1680s]   File "/home/abuild/rpmbuild/BUILD/Python-3.10.0/Lib/test/test_concurrent_futures.py", line 1159 in test_crash_during_func_exec_on_worker
[ 1680s]   File "/home/abuild/rpmbuild/BUILD/Python-3.10.0/Lib/unittest/case.py", line 549 in _callTestMethod
[ 1680s]   File "/home/abuild/rpmbuild/BUILD/Python-3.10.0/Lib/unittest/case.py", line 591 in run
[ 1680s]   File "/home/abuild/rpmbuild/BUILD/Python-3.10.0/Lib/unittest/case.py", line 650 in __call__
[ 1680s]   File "/home/abuild/rpmbuild/BUILD/Python-3.10.0/Lib/unittest/suite.py", line 122 in run
[ 1680s]   File "/home/abuild/rpmbuild/BUILD/Python-3.10.0/Lib/unittest/suite.py", line 84 in __call__
[ 1680s]   File "/home/abuild/rpmbuild/BUILD/Python-3.10.0/Lib/unittest/suite.py", line 122 in run
[ 1680s]   File "/home/abuild/rpmbuild/BUILD/Python-3.10.0/Lib/unittest/suite.py", line 84 in __call__
[ 1680s]   File "/home/abuild/rpmbuild/BUILD/Python-3.10.0/Lib/unittest/suite.py", line 122 in run
[ 1680s]   File "/home/abuild/rpmbuild/BUILD/Python-3.10.0/Lib/unittest/suite.py", line 84 in __call__
[ 1680s]   File "/home/abuild/rpmbuild/BUILD/Python-3.10.0/Lib/unittest/runner.py", line 176 in run
[ 1680s]   File "/home/abuild/rpmbuild/BUILD/Python-3.10.0/Lib/test/support/__init__.py", line 990 in _run_suite
[ 1680s]   File "/home/abuild/rpmbuild/BUILD/Python-3.10.0/Lib/test/support/__init__.py", line 1115 in run_unittest
[ 1680s]   File "/home/abuild/rpmbuild/BUILD/Python-3.10.0/Lib/test/libregrtest/runtest.py", line 261 in _test_module
[ 1680s]   File "/home/abuild/rpmbuild/BUILD/Python-3.10.0/Lib/test/libregrtest/runtest.py", line 297 in _runtest_inner2
[ 1680s]   File "/home/abuild/rpmbuild/BUILD/Python-3.10.0/Lib/test/libregrtest/runtest.py", line 335 in _runtest_inner
[ 1680s]   File "/home/abuild/rpmbuild/BUILD/Python-3.10.0/Lib/test/libregrtest/runtest.py", line 202 in _runtest
[ 1680s]   File "/home/abuild/rpmbuild/BUILD/Python-3.10.0/Lib/test/libregrtest/runtest.py", line 245 in runtest
[ 1680s]   File "/home/abuild/rpmbuild/BUILD/Python-3.10.0/Lib/test/libregrtest/runtest_mp.py", line 83 in run_tests_worker
[ 1680s]   File "/home/abuild/rpmbuild/BUILD/Python-3.10.0/Lib/test/libregrtest/main.py", line 678 in _main
[ 1680s]   File "/home/abuild/rpmbuild/BUILD/Python-3.10.0/Lib/test/libregrtest/main.py", line 658 in main
[ 1680s]   File "/home/abuild/rpmbuild/BUILD/Python-3.10.0/Lib/test/libregrtest/main.py", line 736 in main
[ 1680s]   File "/home/abuild/rpmbuild/BUILD/Python-3.10.0/Lib/test/regrtest.py", line 43 in _main
[ 1680s]   File "/home/abuild/rpmbuild/BUILD/Python-3.10.0/Lib/test/regrtest.py", line 47 in <module>
[ 1680s]   File "/home/abuild/rpmbuild/BUILD/Python-3.10.0/Lib/runpy.py", line 86 in _run_code
[ 1680s]   File "/home/abuild/rpmbuild/BUILD/Python-3.10.0/Lib/runpy.py", line 196 in _run_module_as_main
[ 1680s]
[ 1680s]
[ 1680s] ======================================================================
[ 1680s] FAIL: test_crash_during_result_pickle_on_worker (test.test_concurrent_futures.ProcessPoolForkserverExecutorDeadlockTest)
[ 1680s] ----------------------------------------------------------------------
[ 1680s] Traceback (most recent call last):
[ 1680s]   File "/home/abuild/rpmbuild/BUILD/Python-3.10.0/Lib/test/test_concurrent_futures.py", line 1133, in _check_crash
[ 1680s]     res.result(timeout=self.TIMEOUT)
[ 1680s]   File "/home/abuild/rpmbuild/BUILD/Python-3.10.0/Lib/concurrent/futures/_base.py", line 447, in result
[ 1680s]     raise TimeoutError()
[ 1680s] concurrent.futures._base.TimeoutError
[ 1680s]
[ 1680s] During handling of the above exception, another exception occurred:
[ 1680s]
[ 1680s] Traceback (most recent call last):
[ 1680s]   File "/home/abuild/rpmbuild/BUILD/Python-3.10.0/Lib/test/test_concurrent_futures.py", line 1172, in test_crash_during_result_pickle_on_worker
[ 1680s]     self._check_crash(BrokenProcessPool, _return_instance, CrashAtPickle)
[ 1680s]   File "/home/abuild/rpmbuild/BUILD/Python-3.10.0/Lib/test/test_concurrent_futures.py", line 1137, in _check_crash
[ 1680s]     self._fail_on_deadlock(executor)
[ 1680s]   File "/home/abuild/rpmbuild/BUILD/Python-3.10.0/Lib/test/test_concurrent_futures.py", line 1114, in _fail_on_deadlock
[ 1680s]     self.fail(f"Executor deadlock:\n\n{tb}")
[ 1680s] AssertionError: Executor deadlock:
[ 1680s]
[ 1680s] Thread 0x00007f6389d6f700 (most recent call first):
[ 1680s]   File "/home/abuild/rpmbuild/BUILD/Python-3.10.0/Lib/threading.py", line 320 in wait
[ 1680s]   File "/home/abuild/rpmbuild/BUILD/Python-3.10.0/Lib/multiprocessing/queues.py", line 233 in _feed
[ 1680s]   File "/home/abuild/rpmbuild/BUILD/Python-3.10.0/Lib/threading.py", line 946 in run
[ 1680s]   File "/home/abuild/rpmbuild/BUILD/Python-3.10.0/Lib/threading.py", line 1009 in _bootstrap_inner
[ 1680s]   File "/home/abuild/rpmbuild/BUILD/Python-3.10.0/Lib/threading.py", line 966 in _bootstrap
[ 1680s]
[ 1680s] Thread 0x00007f638a570700 (most recent call first):
[ 1680s]   File "/home/abuild/rpmbuild/BUILD/Python-3.10.0/Lib/selectors.py", line 416 in select
[ 1680s]   File "/home/abuild/rpmbuild/BUILD/Python-3.10.0/Lib/multiprocessing/connection.py", line 936 in wait
[ 1680s]   File "/home/abuild/rpmbuild/BUILD/Python-3.10.0/Lib/concurrent/futures/process.py", line 377 in wait_result_broken_or_wakeup
[ 1680s]   File "/home/abuild/rpmbuild/BUILD/Python-3.10.0/Lib/concurrent/futures/process.py", line 317 in run
[ 1680s]   File "/home/abuild/rpmbuild/BUILD/Python-3.10.0/Lib/threading.py", line 1009 in _bootstrap_inner
[ 1680s]   File "/home/abuild/rpmbuild/BUILD/Python-3.10.0/Lib/threading.py", line 966 in _bootstrap
[ 1680s]
[ 1680s] Current thread 0x00007f63982a1740 (most recent call first):
[ 1680s]   File "/home/abuild/rpmbuild/BUILD/Python-3.10.0/Lib/test/test_concurrent_futures.py", line 1105 in _fail_on_deadlock
[ 1680s]   File "/home/abuild/rpmbuild/BUILD/Python-3.10.0/Lib/test/test_concurrent_futures.py", line 1137 in _check_crash
[ 1680s]   File "/home/abuild/rpmbuild/BUILD/Python-3.10.0/Lib/test/test_concurrent_futures.py", line 1172 in test_crash_during_result_pickle_on_worker
[ 1680s]   File "/home/abuild/rpmbuild/BUILD/Python-3.10.0/Lib/unittest/case.py", line 549 in _callTestMethod
[ 1680s]   File "/home/abuild/rpmbuild/BUILD/Python-3.10.0/Lib/unittest/case.py", line 591 in run
[ 1680s]   File "/home/abuild/rpmbuild/BUILD/Python-3.10.0/Lib/unittest/case.py", line 650 in __call__
[ 1680s]   File "/home/abuild/rpmbuild/BUILD/Python-3.10.0/Lib/unittest/suite.py", line 122 in run
[ 1680s]   File "/home/abuild/rpmbuild/BUILD/Python-3.10.0/Lib/unittest/suite.py", line 84 in __call__
[ 1680s]   File "/home/abuild/rpmbuild/BUILD/Python-3.10.0/Lib/unittest/suite.py", line 122 in run
[ 1680s]   File "/home/abuild/rpmbuild/BUILD/Python-3.10.0/Lib/unittest/suite.py", line 84 in __call__
[ 1680s]   File "/home/abuild/rpmbuild/BUILD/Python-3.10.0/Lib/unittest/suite.py", line 122 in run
[ 1680s]   File "/home/abuild/rpmbuild/BUILD/Python-3.10.0/Lib/unittest/suite.py", line 84 in __call__
[ 1680s]   File "/home/abuild/rpmbuild/BUILD/Python-3.10.0/Lib/unittest/runner.py", line 176 in run
[ 1680s]   File "/home/abuild/rpmbuild/BUILD/Python-3.10.0/Lib/test/support/__init__.py", line 990 in _run_suite
[ 1680s]   File "/home/abuild/rpmbuild/BUILD/Python-3.10.0/Lib/test/support/__init__.py", line 1115 in run_unittest
[ 1680s]   File "/home/abuild/rpmbuild/BUILD/Python-3.10.0/Lib/test/libregrtest/runtest.py", line 261 in _test_module
[ 1680s]   File "/home/abuild/rpmbuild/BUILD/Python-3.10.0/Lib/test/libregrtest/runtest.py", line 297 in _runtest_inner2
[ 1680s]   File "/home/abuild/rpmbuild/BUILD/Python-3.10.0/Lib/test/libregrtest/runtest.py", line 335 in _runtest_inner
[ 1680s]   File "/home/abuild/rpmbuild/BUILD/Python-3.10.0/Lib/test/libregrtest/runtest.py", line 202 in _runtest
[ 1680s]   File "/home/abuild/rpmbuild/BUILD/Python-3.10.0/Lib/test/libregrtest/runtest.py", line 245 in runtest
[ 1680s]   File "/home/abuild/rpmbuild/BUILD/Python-3.10.0/Lib/test/libregrtest/runtest_mp.py", line 83 in run_tests_worker
[ 1680s]   File "/home/abuild/rpmbuild/BUILD/Python-3.10.0/Lib/test/libregrtest/main.py", line 678 in _main
[ 1680s]   File "/home/abuild/rpmbuild/BUILD/Python-3.10.0/Lib/test/libregrtest/main.py", line 658 in main
[ 1680s]   File "/home/abuild/rpmbuild/BUILD/Python-3.10.0/Lib/test/libregrtest/main.py", line 736 in main
[ 1680s]   File "/home/abuild/rpmbuild/BUILD/Python-3.10.0/Lib/test/regrtest.py", line 43 in _main
[ 1680s]   File "/home/abuild/rpmbuild/BUILD/Python-3.10.0/Lib/test/regrtest.py", line 47 in <module>
[ 1680s]   File "/home/abuild/rpmbuild/BUILD/Python-3.10.0/Lib/runpy.py", line 86 in _run_code
[ 1680s]   File "/home/abuild/rpmbuild/BUILD/Python-3.10.0/Lib/runpy.py", line 196 in _run_module_as_main
[ 1680s]
[ 1680s]
[ 1680s] ======================================================================
[ 1680s] FAIL: test_crash_at_task_unpickle (test.test_concurrent_futures.ProcessPoolSpawnExecutorDeadlockTest)
[ 1680s] ----------------------------------------------------------------------
[ 1680s] Traceback (most recent call last):
[ 1680s]   File "/home/abuild/rpmbuild/BUILD/Python-3.10.0/Lib/test/test_concurrent_futures.py", line 1133, in _check_crash
[ 1680s]     res.result(timeout=self.TIMEOUT)
[ 1680s]   File "/home/abuild/rpmbuild/BUILD/Python-3.10.0/Lib/concurrent/futures/_base.py", line 447, in result
[ 1680s]     raise TimeoutError()
[ 1680s] concurrent.futures._base.TimeoutError
[ 1680s]
[ 1680s] During handling of the above exception, another exception occurred:
[ 1680s]
[ 1680s] Traceback (most recent call last):
[ 1680s]   File "/home/abuild/rpmbuild/BUILD/Python-3.10.0/Lib/test/test_concurrent_futures.py", line 1155, in test_crash_at_task_unpickle
[ 1680s]     self._check_crash(BrokenProcessPool, id, CrashAtUnpickle())
[ 1680s]   File "/home/abuild/rpmbuild/BUILD/Python-3.10.0/Lib/test/test_concurrent_futures.py", line 1137, in _check_crash
[ 1680s]     self._fail_on_deadlock(executor)
[ 1680s]   File "/home/abuild/rpmbuild/BUILD/Python-3.10.0/Lib/test/test_concurrent_futures.py", line 1114, in _fail_on_deadlock
[ 1680s]     self.fail(f"Executor deadlock:\n\n{tb}")
[ 1680s] AssertionError: Executor deadlock:
[ 1680s]
[ 1680s] Thread 0x00007f6389d6f700 (most recent call first):
[ 1680s]   File "/home/abuild/rpmbuild/BUILD/Python-3.10.0/Lib/threading.py", line 320 in wait
[ 1680s]   File "/home/abuild/rpmbuild/BUILD/Python-3.10.0/Lib/multiprocessing/queues.py", line 233 in _feed
[ 1680s]   File "/home/abuild/rpmbuild/BUILD/Python-3.10.0/Lib/threading.py", line 946 in run
[ 1680s]   File "/home/abuild/rpmbuild/BUILD/Python-3.10.0/Lib/threading.py", line 1009 in _bootstrap_inner
[ 1680s]   File "/home/abuild/rpmbuild/BUILD/Python-3.10.0/Lib/threading.py", line 966 in _bootstrap
[ 1680s]
[ 1680s] Thread 0x00007f638a570700 (most recent call first):
[ 1680s]   File "/home/abuild/rpmbuild/BUILD/Python-3.10.0/Lib/selectors.py", line 416 in select
[ 1680s]   File "/home/abuild/rpmbuild/BUILD/Python-3.10.0/Lib/multiprocessing/connection.py", line 936 in wait
[ 1680s]   File "/home/abuild/rpmbuild/BUILD/Python-3.10.0/Lib/concurrent/futures/process.py", line 377 in wait_result_broken_or_wakeup
[ 1680s]   File "/home/abuild/rpmbuild/BUILD/Python-3.10.0/Lib/concurrent/futures/process.py", line 317 in run
[ 1680s]   File "/home/abuild/rpmbuild/BUILD/Python-3.10.0/Lib/threading.py", line 1009 in _bootstrap_inner
[ 1680s]   File "/home/abuild/rpmbuild/BUILD/Python-3.10.0/Lib/threading.py", line 966 in _bootstrap
[ 1680s]
[ 1680s] Current thread 0x00007f63982a1740 (most recent call first):
[ 1680s]   File "/home/abuild/rpmbuild/BUILD/Python-3.10.0/Lib/test/test_concurrent_futures.py", line 1105 in _fail_on_deadlock
[ 1680s]   File "/home/abuild/rpmbuild/BUILD/Python-3.10.0/Lib/test/test_concurrent_futures.py", line 1137 in _check_crash
[ 1680s]   File "/home/abuild/rpmbuild/BUILD/Python-3.10.0/Lib/test/test_concurrent_futures.py", line 1155 in test_crash_at_task_unpickle
[ 1680s]   File "/home/abuild/rpmbuild/BUILD/Python-3.10.0/Lib/unittest/case.py", line 549 in _callTestMethod
[ 1680s]   File "/home/abuild/rpmbuild/BUILD/Python-3.10.0/Lib/unittest/case.py", line 591 in run
[ 1680s]   File "/home/abuild/rpmbuild/BUILD/Python-3.10.0/Lib/unittest/case.py", line 650 in __call__
[ 1680s]   File "/home/abuild/rpmbuild/BUILD/Python-3.10.0/Lib/unittest/suite.py", line 122 in run
[ 1680s]   File "/home/abuild/rpmbuild/BUILD/Python-3.10.0/Lib/unittest/suite.py", line 84 in __call__
[ 1680s]   File "/home/abuild/rpmbuild/BUILD/Python-3.10.0/Lib/unittest/suite.py", line 122 in run
[ 1680s]   File "/home/abuild/rpmbuild/BUILD/Python-3.10.0/Lib/unittest/suite.py", line 84 in __call__
[ 1680s]   File "/home/abuild/rpmbuild/BUILD/Python-3.10.0/Lib/unittest/suite.py", line 122 in run
[ 1680s]   File "/home/abuild/rpmbuild/BUILD/Python-3.10.0/Lib/unittest/suite.py", line 84 in __call__
[ 1680s]   File "/home/abuild/rpmbuild/BUILD/Python-3.10.0/Lib/unittest/runner.py", line 176 in run
[ 1680s]   File "/home/abuild/rpmbuild/BUILD/Python-3.10.0/Lib/test/support/__init__.py", line 990 in _run_suite
[ 1680s]   File "/home/abuild/rpmbuild/BUILD/Python-3.10.0/Lib/test/support/__init__.py", line 1115 in run_unittest
[ 1680s]   File "/home/abuild/rpmbuild/BUILD/Python-3.10.0/Lib/test/libregrtest/runtest.py", line 261 in _test_module
[ 1680s]   File "/home/abuild/rpmbuild/BUILD/Python-3.10.0/Lib/test/libregrtest/runtest.py", line 297 in _runtest_inner2
[ 1680s]   File "/home/abuild/rpmbuild/BUILD/Python-3.10.0/Lib/test/libregrtest/runtest.py", line 335 in _runtest_inner
[ 1680s]   File "/home/abuild/rpmbuild/BUILD/Python-3.10.0/Lib/test/libregrtest/runtest.py", line 202 in _runtest
[ 1680s]   File "/home/abuild/rpmbuild/BUILD/Python-3.10.0/Lib/test/libregrtest/runtest.py", line 245 in runtest
[ 1680s]   File "/home/abuild/rpmbuild/BUILD/Python-3.10.0/Lib/test/libregrtest/runtest_mp.py", line 83 in run_tests_worker
[ 1680s]   File "/home/abuild/rpmbuild/BUILD/Python-3.10.0/Lib/test/libregrtest/main.py", line 678 in _main
[ 1680s]   File "/home/abuild/rpmbuild/BUILD/Python-3.10.0/Lib/test/libregrtest/main.py", line 658 in main
[ 1680s]   File "/home/abuild/rpmbuild/BUILD/Python-3.10.0/Lib/test/libregrtest/main.py", line 736 in main
[ 1680s]   File "/home/abuild/rpmbuild/BUILD/Python-3.10.0/Lib/test/regrtest.py", line 43 in _main
[ 1680s]   File "/home/abuild/rpmbuild/BUILD/Python-3.10.0/Lib/test/regrtest.py", line 47 in <module>
[ 1680s]   File "/home/abuild/rpmbuild/BUILD/Python-3.10.0/Lib/runpy.py", line 86 in _run_code
[ 1680s]   File "/home/abuild/rpmbuild/BUILD/Python-3.10.0/Lib/runpy.py", line 196 in _run_module_as_main
[ 1680s]
[ 1680s]
[ 1680s] ======================================================================
[ 1680s] FAIL: test_crash_during_func_exec_on_worker (test.test_concurrent_futures.ProcessPoolSpawnExecutorDeadlockTest)
[ 1680s] ----------------------------------------------------------------------
[ 1680s] Traceback (most recent call last):
[ 1680s]   File "/home/abuild/rpmbuild/BUILD/Python-3.10.0/Lib/test/test_concurrent_futures.py", line 1133, in _check_crash
[ 1680s]     res.result(timeout=self.TIMEOUT)
[ 1680s]   File "/home/abuild/rpmbuild/BUILD/Python-3.10.0/Lib/concurrent/futures/_base.py", line 447, in result
[ 1680s]     raise TimeoutError()
[ 1680s] concurrent.futures._base.TimeoutError
[ 1680s]
[ 1680s] During handling of the above exception, another exception occurred:
[ 1680s]
[ 1680s] Traceback (most recent call last):
[ 1680s]   File "/home/abuild/rpmbuild/BUILD/Python-3.10.0/Lib/test/test_concurrent_futures.py", line 1159, in test_crash_during_func_exec_on_worker
[ 1680s]     self._check_crash(BrokenProcessPool, _crash)
[ 1680s]   File "/home/abuild/rpmbuild/BUILD/Python-3.10.0/Lib/test/test_concurrent_futures.py", line 1137, in _check_crash
[ 1680s]     self._fail_on_deadlock(executor)
[ 1680s]   File "/home/abuild/rpmbuild/BUILD/Python-3.10.0/Lib/test/test_concurrent_futures.py", line 1114, in _fail_on_deadlock
[ 1680s]     self.fail(f"Executor deadlock:\n\n{tb}")
[ 1680s] AssertionError: Executor deadlock:
[ 1680s]
[ 1680s] Thread 0x00007f6389d6f700 (most recent call first):
[ 1680s]   File "/home/abuild/rpmbuild/BUILD/Python-3.10.0/Lib/threading.py", line 320 in wait
[ 1680s]   File "/home/abuild/rpmbuild/BUILD/Python-3.10.0/Lib/multiprocessing/queues.py", line 233 in _feed
[ 1680s]   File "/home/abuild/rpmbuild/BUILD/Python-3.10.0/Lib/threading.py", line 946 in run
[ 1680s]   File "/home/abuild/rpmbuild/BUILD/Python-3.10.0/Lib/threading.py", line 1009 in _bootstrap_inner
[ 1680s]   File "/home/abuild/rpmbuild/BUILD/Python-3.10.0/Lib/threading.py", line 966 in _bootstrap
[ 1680s]
[ 1680s] Thread 0x00007f638a570700 (most recent call first):
[ 1680s]   File "/home/abuild/rpmbuild/BUILD/Python-3.10.0/Lib/selectors.py", line 416 in select
[ 1680s]   File "/home/abuild/rpmbuild/BUILD/Python-3.10.0/Lib/multiprocessing/connection.py", line 936 in wait
[ 1680s]   File "/home/abuild/rpmbuild/BUILD/Python-3.10.0/Lib/concurrent/futures/process.py", line 377 in wait_result_broken_or_wakeup
[ 1680s]   File "/home/abuild/rpmbuild/BUILD/Python-3.10.0/Lib/concurrent/futures/process.py", line 317 in run
[ 1680s]   File "/home/abuild/rpmbuild/BUILD/Python-3.10.0/Lib/threading.py", line 1009 in _bootstrap_inner
[ 1680s]   File "/home/abuild/rpmbuild/BUILD/Python-3.10.0/Lib/threading.py", line 966 in _bootstrap
[ 1680s]
[ 1680s] Current thread 0x00007f63982a1740 (most recent call first):
[ 1680s]   File "/home/abuild/rpmbuild/BUILD/Python-3.10.0/Lib/test/test_concurrent_futures.py", line 1105 in _fail_on_deadlock
[ 1680s]   File "/home/abuild/rpmbuild/BUILD/Python-3.10.0/Lib/test/test_concurrent_futures.py", line 1137 in _check_crash
[ 1680s]   File "/home/abuild/rpmbuild/BUILD/Python-3.10.0/Lib/test/test_concurrent_futures.py", line 1159 in test_crash_during_func_exec_on_worker
[ 1680s]   File "/home/abuild/rpmbuild/BUILD/Python-3.10.0/Lib/unittest/case.py", line 549 in _callTestMethod
[ 1680s]   File "/home/abuild/rpmbuild/BUILD/Python-3.10.0/Lib/unittest/case.py", line 591 in run
[ 1680s]   File "/home/abuild/rpmbuild/BUILD/Python-3.10.0/Lib/unittest/case.py", line 650 in __call__
[ 1680s]   File "/home/abuild/rpmbuild/BUILD/Python-3.10.0/Lib/unittest/suite.py", line 122 in run
[ 1680s]   File "/home/abuild/rpmbuild/BUILD/Python-3.10.0/Lib/unittest/suite.py", line 84 in __call__
[ 1680s]   File "/home/abuild/rpmbuild/BUILD/Python-3.10.0/Lib/unittest/suite.py", line 122 in run
[ 1680s]   File "/home/abuild/rpmbuild/BUILD/Python-3.10.0/Lib/unittest/suite.py", line 84 in __call__
[ 1680s]   File "/home/abuild/rpmbuild/BUILD/Python-3.10.0/Lib/unittest/suite.py", line 122 in run
[ 1680s]   File "/home/abuild/rpmbuild/BUILD/Python-3.10.0/Lib/unittest/suite.py", line 84 in __call__
[ 1680s]   File "/home/abuild/rpmbuild/BUILD/Python-3.10.0/Lib/unittest/runner.py", line 176 in run
[ 1680s]   File "/home/abuild/rpmbuild/BUILD/Python-3.10.0/Lib/test/support/__init__.py", line 990 in _run_suite
[ 1680s]   File "/home/abuild/rpmbuild/BUILD/Python-3.10.0/Lib/test/support/__init__.py", line 1115 in run_unittest
[ 1680s]   File "/home/abuild/rpmbuild/BUILD/Python-3.10.0/Lib/test/libregrtest/runtest.py", line 261 in _test_module
[ 1680s]   File "/home/abuild/rpmbuild/BUILD/Python-3.10.0/Lib/test/libregrtest/runtest.py", line 297 in _runtest_inner2
[ 1680s]   File "/home/abuild/rpmbuild/BUILD/Python-3.10.0/Lib/test/libregrtest/runtest.py", line 335 in _runtest_inner
[ 1680s]   File "/home/abuild/rpmbuild/BUILD/Python-3.10.0/Lib/test/libregrtest/runtest.py", line 202 in _runtest
[ 1680s]   File "/home/abuild/rpmbuild/BUILD/Python-3.10.0/Lib/test/libregrtest/runtest.py", line 245 in runtest
[ 1680s]   File "/home/abuild/rpmbuild/BUILD/Python-3.10.0/Lib/test/libregrtest/runtest_mp.py", line 83 in run_tests_worker
[ 1680s]   File "/home/abuild/rpmbuild/BUILD/Python-3.10.0/Lib/test/libregrtest/main.py", line 678 in _main
[ 1680s]   File "/home/abuild/rpmbuild/BUILD/Python-3.10.0/Lib/test/libregrtest/main.py", line 658 in main
[ 1680s]   File "/home/abuild/rpmbuild/BUILD/Python-3.10.0/Lib/test/libregrtest/main.py", line 736 in main
[ 1680s]   File "/home/abuild/rpmbuild/BUILD/Python-3.10.0/Lib/test/regrtest.py", line 43 in _main
[ 1680s]   File "/home/abuild/rpmbuild/BUILD/Python-3.10.0/Lib/test/regrtest.py", line 47 in <module>
[ 1680s]   File "/home/abuild/rpmbuild/BUILD/Python-3.10.0/Lib/runpy.py", line 86 in _run_code
[ 1680s]   File "/home/abuild/rpmbuild/BUILD/Python-3.10.0/Lib/runpy.py", line 196 in _run_module_as_main
[ 1680s]
[ 1680s]
[ 1680s] ======================================================================
[ 1680s] FAIL: test_crash_during_result_pickle_on_worker (test.test_concurrent_futures.ProcessPoolSpawnExecutorDeadlockTest)
[ 1680s] ----------------------------------------------------------------------
[ 1680s] Traceback (most recent call last):
[ 1680s]   File "/home/abuild/rpmbuild/BUILD/Python-3.10.0/Lib/test/test_concurrent_futures.py", line 1133, in _check_crash
[ 1680s]     res.result(timeout=self.TIMEOUT)
[ 1680s]   File "/home/abuild/rpmbuild/BUILD/Python-3.10.0/Lib/concurrent/futures/_base.py", line 447, in result
[ 1680s]     raise TimeoutError()
[ 1680s] concurrent.futures._base.TimeoutError
[ 1680s]
[ 1680s] During handling of the above exception, another exception occurred:
[ 1680s]
[ 1680s] Traceback (most recent call last):
[ 1680s]   File "/home/abuild/rpmbuild/BUILD/Python-3.10.0/Lib/test/test_concurrent_futures.py", line 1172, in test_crash_during_result_pickle_on_worker
[ 1680s]     self._check_crash(BrokenProcessPool, _return_instance, CrashAtPickle)
[ 1680s]   File "/home/abuild/rpmbuild/BUILD/Python-3.10.0/Lib/test/test_concurrent_futures.py", line 1137, in _check_crash
[ 1680s]     self._fail_on_deadlock(executor)
[ 1680s]   File "/home/abuild/rpmbuild/BUILD/Python-3.10.0/Lib/test/test_concurrent_futures.py", line 1114, in _fail_on_deadlock
[ 1680s]     self.fail(f"Executor deadlock:\n\n{tb}")
[ 1680s] AssertionError: Executor deadlock:
[ 1680s]
[ 1680s] Thread 0x00007f6389d6f700 (most recent call first):
[ 1680s]   File "/home/abuild/rpmbuild/BUILD/Python-3.10.0/Lib/threading.py", line 320 in wait
[ 1680s]   File "/home/abuild/rpmbuild/BUILD/Python-3.10.0/Lib/multiprocessing/queues.py", line 233 in _feed
[ 1680s]   File "/home/abuild/rpmbuild/BUILD/Python-3.10.0/Lib/threading.py", line 946 in run
[ 1680s]   File "/home/abuild/rpmbuild/BUILD/Python-3.10.0/Lib/threading.py", line 1009 in _bootstrap_inner
[ 1680s]   File "/home/abuild/rpmbuild/BUILD/Python-3.10.0/Lib/threading.py", line 966 in _bootstrap
[ 1680s]
[ 1680s] Thread 0x00007f638a570700 (most recent call first):
[ 1680s]   File "/home/abuild/rpmbuild/BUILD/Python-3.10.0/Lib/selectors.py", line 416 in select
[ 1680s]   File "/home/abuild/rpmbuild/BUILD/Python-3.10.0/Lib/multiprocessing/connection.py", line 936 in wait
[ 1680s]   File "/home/abuild/rpmbuild/BUILD/Python-3.10.0/Lib/concurrent/futures/process.py", line 377 in wait_result_broken_or_wakeup
[ 1680s]   File "/home/abuild/rpmbuild/BUILD/Python-3.10.0/Lib/concurrent/futures/process.py", line 317 in run
[ 1680s]   File "/home/abuild/rpmbuild/BUILD/Python-3.10.0/Lib/threading.py", line 1009 in _bootstrap_inner
[ 1680s]   File "/home/abuild/rpmbuild/BUILD/Python-3.10.0/Lib/threading.py", line 966 in _bootstrap
[ 1680s]
[ 1680s] Current thread 0x00007f63982a1740 (most recent call first):
[ 1680s]   File "/home/abuild/rpmbuild/BUILD/Python-3.10.0/Lib/test/test_concurrent_futures.py", line 1105 in _fail_on_deadlock
[ 1680s]   File "/home/abuild/rpmbuild/BUILD/Python-3.10.0/Lib/test/test_concurrent_futures.py", line 1137 in _check_crash
[ 1680s]   File "/home/abuild/rpmbuild/BUILD/Python-3.10.0/Lib/test/test_concurrent_futures.py", line 1172 in test_crash_during_result_pickle_on_worker
[ 1680s]   File "/home/abuild/rpmbuild/BUILD/Python-3.10.0/Lib/unittest/case.py", line 549 in _callTestMethod
[ 1680s]   File "/home/abuild/rpmbuild/BUILD/Python-3.10.0/Lib/unittest/case.py", line 591 in run
[ 1680s]   File "/home/abuild/rpmbuild/BUILD/Python-3.10.0/Lib/unittest/case.py", line 650 in __call__
[ 1680s]   File "/home/abuild/rpmbuild/BUILD/Python-3.10.0/Lib/unittest/suite.py", line 122 in run
[ 1680s]   File "/home/abuild/rpmbuild/BUILD/Python-3.10.0/Lib/unittest/suite.py", line 84 in __call__
[ 1680s]   File "/home/abuild/rpmbuild/BUILD/Python-3.10.0/Lib/unittest/suite.py", line 122 in run
[ 1680s]   File "/home/abuild/rpmbuild/BUILD/Python-3.10.0/Lib/unittest/suite.py", line 84 in __call__
[ 1680s]   File "/home/abuild/rpmbuild/BUILD/Python-3.10.0/Lib/unittest/suite.py", line 122 in run
[ 1680s]   File "/home/abuild/rpmbuild/BUILD/Python-3.10.0/Lib/unittest/suite.py", line 84 in __call__
[ 1680s]   File "/home/abuild/rpmbuild/BUILD/Python-3.10.0/Lib/unittest/runner.py", line 176 in run
[ 1680s]   File "/home/abuild/rpmbuild/BUILD/Python-3.10.0/Lib/test/support/__init__.py", line 990 in _run_suite
[ 1680s]   File "/home/abuild/rpmbuild/BUILD/Python-3.10.0/Lib/test/support/__init__.py", line 1115 in run_unittest
[ 1680s]   File "/home/abuild/rpmbuild/BUILD/Python-3.10.0/Lib/test/libregrtest/runtest.py", line 261 in _test_module
[ 1680s]   File "/home/abuild/rpmbuild/BUILD/Python-3.10.0/Lib/test/libregrtest/runtest.py", line 297 in _runtest_inner2
[ 1680s]   File "/home/abuild/rpmbuild/BUILD/Python-3.10.0/Lib/test/libregrtest/runtest.py", line 335 in _runtest_inner
[ 1680s]   File "/home/abuild/rpmbuild/BUILD/Python-3.10.0/Lib/test/libregrtest/runtest.py", line 202 in _runtest
[ 1680s]   File "/home/abuild/rpmbuild/BUILD/Python-3.10.0/Lib/test/libregrtest/runtest.py", line 245 in runtest
[ 1680s]   File "/home/abuild/rpmbuild/BUILD/Python-3.10.0/Lib/test/libregrtest/runtest_mp.py", line 83 in run_tests_worker
[ 1680s]   File "/home/abuild/rpmbuild/BUILD/Python-3.10.0/Lib/test/libregrtest/main.py", line 678 in _main
[ 1680s]   File "/home/abuild/rpmbuild/BUILD/Python-3.10.0/Lib/test/libregrtest/main.py", line 658 in main
[ 1680s]   File "/home/abuild/rpmbuild/BUILD/Python-3.10.0/Lib/test/libregrtest/main.py", line 736 in main
[ 1680s]   File "/home/abuild/rpmbuild/BUILD/Python-3.10.0/Lib/test/regrtest.py", line 43 in _main
[ 1680s]   File "/home/abuild/rpmbuild/BUILD/Python-3.10.0/Lib/test/regrtest.py", line 47 in <module>
[ 1680s]   File "/home/abuild/rpmbuild/BUILD/Python-3.10.0/Lib/runpy.py", line 86 in _run_code
[ 1680s]   File "/home/abuild/rpmbuild/BUILD/Python-3.10.0/Lib/runpy.py", line 196 in _run_module_as_main
[ 1680s]
[ 1680s]
[ 1680s] ----------------------------------------------------------------------
[ 1680s] Ran 226 tests in 1091.207s
[ 1680s]
[ 1680s] FAILED (failures=9, skipped=6)
[ 1680s] test test_concurrent_futures failed
[ 1710s] 0:18:48 load avg: 4.43 running: test_capi (18 min 45 sec), test_faulthandler (18 min 35 sec)
[ 1740s] 0:19:18 load avg: 4.34 running: test_capi (19 min 15 sec), test_faulthandler (19 min 5 sec)
[ 1770s] 0:19:48 load avg: 4.44 running: test_capi (19 min 45 sec), test_faulthandler (19 min 35 sec)
[ 1800s] 0:20:18 load avg: 4.38 running: test_capi (20 min 15 sec), test_faulthandler (20 min 5 sec)
[ 1830s] 0:20:48 load avg: 4.33 running: test_capi (20 min 45 sec), test_faulthandler (20 min 35 sec)
[ 1830s] 0:20:48 load avg: 4.33 [422/423/1] test_faulthandler passed (20 min 34 sec) -- running: test_capi (20 min 45 sec)
[ 1860s] 0:21:18 load avg: 3.86 running: test_capi (21 min 15 sec)
[ 1890s] 0:21:48 load avg: 3.51 running: test_capi (21 min 45 sec)
[ 1920s] 0:22:18 load avg: 3.33 running: test_capi (22 min 15 sec)
[ 1950s] 0:22:48 load avg: 3.66 running: test_capi (22 min 45 sec)
[ 1980s] 0:23:18 load avg: 3.44 running: test_capi (23 min 15 sec)
[ 2010s] 0:23:48 load avg: 3.42 running: test_capi (23 min 45 sec)
[ 2040s] 0:24:18 load avg: 3.45 running: test_capi (24 min 15 sec)
[ 2070s] 0:24:48 load avg: 3.43 running: test_capi (24 min 45 sec)
[ 2100s] 0:25:18 load avg: 3.85 running: test_capi (25 min 15 sec)
[ 2130s] 0:25:48 load avg: 4.27 running: test_capi (25 min 45 sec)
[ 2160s] 0:26:18 load avg: 4.32 running: test_capi (26 min 15 sec)
[ 2190s] 0:26:48 load avg: 4.17 running: test_capi (26 min 45 sec)
[ 2220s] 0:27:18 load avg: 4.10 running: test_capi (27 min 15 sec)
[ 2238s] 0:27:36 load avg: 3.72 [423/423/1] test_capi passed (27 min 32 sec)
[ 2238s]
[ 2238s] == Tests result: FAILURE ==
[ 2238s]
[ 2238s] 402 tests OK.
[ 2238s]
[ 2238s] 10 slowest tests:
[ 2238s] - test_capi: 27 min 32 sec
[ 2238s] - test_faulthandler: 20 min 34 sec
[ 2238s] - test_concurrent_futures: 18 min 11 sec
[ 2238s] - test_io: 3 min 11 sec
[ 2238s] - test_subprocess: 2 min 26 sec
[ 2238s] - test_peg_generator: 2 min 19 sec
[ 2238s] - test_audit: 2 min 16 sec
[ 2238s] - test_multiprocessing_spawn: 2 min 9 sec
[ 2238s] - test_regrtest: 1 min 33 sec
[ 2238s] - test_threading: 1 min 26 sec
[ 2238s]
[ 2238s] 1 test failed:
[ 2238s]     test_concurrent_futures
[ 2238s]
[ 2238s] 20 tests skipped:
[ 2238s]     test_curses test_devpoll test_ioctl test_kqueue test_msilib
[ 2238s]     test_ossaudiodev test_smtpnet test_socketserver test_startfile
[ 2238s]     test_timeout test_tix test_tk test_ttk_guionly test_urllib2net
[ 2238s]     test_urllibnet test_winconsoleio test_winreg test_winsound
[ 2238s]     test_xmlrpc_net test_zipfile64
[ 2238s] 0:27:36 load avg: 3.72
[ 2238s] 0:27:36 load avg: 3.72 Re-running failed tests in verbose mode
[ 2238s] 0:27:36 load avg: 3.72 Re-running test_concurrent_futures in verbose mode (matching: test_crash_at_task_unpickle, test_crash_during_func_exec_on_worker, test_crash_during_result_pickle_on_worker, test_crash_at_task_unpickle, test_crash_during_func_exec_on_worker, test_crash_during_result_pickle_on_worker, test_crash_at_task_unpickle, test_crash_during_func_exec_on_worker, test_crash_during_result_pickle_on_worker)
[ 2318s] test_crash_at_task_unpickle (test.test_concurrent_futures.ProcessPoolForkExecutorDeadlockTest) ...
[ 2318s] Traceback:
[ 2318s]  Thread 0x00007fbd57fff700 (most recent call first):
[ 2318s]   File "/home/abuild/rpmbuild/BUILD/Python-3.10.0/Lib/threading.py", line 320 in wait
[ 2318s]   File "/home/abuild/rpmbuild/BUILD/Python-3.10.0/Lib/multiprocessing/queues.py", line 233 in _feed
[ 2318s]   File "/home/abuild/rpmbuild/BUILD/Python-3.10.0/Lib/threading.py", line 946 in run
[ 2318s]   File "/home/abuild/rpmbuild/BUILD/Python-3.10.0/Lib/threading.py", line 1009 in _bootstrap_inner
[ 2318s]   File "/home/abuild/rpmbuild/BUILD/Python-3.10.0/Lib/threading.py", line 966 in _bootstrap
[ 2318s]
[ 2318s] Thread 0x00007fbd74ff9700 (most recent call first):
[ 2318s]   File "/home/abuild/rpmbuild/BUILD/Python-3.10.0/Lib/selectors.py", line 416 in select
[ 2318s]   File "/home/abuild/rpmbuild/BUILD/Python-3.10.0/Lib/multiprocessing/connection.py", line 936 in wait
[ 2318s]   File "/home/abuild/rpmbuild/BUILD/Python-3.10.0/Lib/concurrent/futures/process.py", line 377 in wait_result_broken_or_wakeup
[ 2318s]   File "/home/abuild/rpmbuild/BUILD/Python-3.10.0/Lib/concurrent/futures/process.py", line 317 in run
[ 2318s]   File "/home/abuild/rpmbuild/BUILD/Python-3.10.0/Lib/threading.py", line 1009 in _bootstrap_inner
[ 2318s]   File "/home/abuild/rpmbuild/BUILD/Python-3.10.0/Lib/threading.py", line 966 in _bootstrap
[ 2318s]
[ 2318s] Current thread 0x00007fbdae8ec740 (most recent call first):
[ 2318s]   File "/home/abuild/rpmbuild/BUILD/Python-3.10.0/Lib/test/test_concurrent_futures.py", line 1105 in _fail_on_deadlock
[ 2318s]   File "/home/abuild/rpmbuild/BUILD/Python-3.10.0/Lib/test/test_concurrent_futures.py", line 1137 in _check_crash
[ 2318s]   File "/home/abuild/rpmbuild/BUILD/Python-3.10.0/Lib/test/test_concurrent_futures.py", line 1155 in test_crash_at_task_unpickle
[ 2318s]   File "/home/abuild/rpmbuild/BUILD/Python-3.10.0/Lib/unittest/case.py", line 549 in _callTestMethod
[ 2318s]   File "/home/abuild/rpmbuild/BUILD/Python-3.10.0/Lib/unittest/case.py", line 591 in run
[ 2318s]   File "/home/abuild/rpmbuild/BUILD/Python-3.10.0/Lib/unittest/case.py", line 650 in __call__
[ 2318s]   File "/home/abuild/rpmbuild/BUILD/Python-3.10.0/Lib/unittest/suite.py", line 122 in run
[ 2318s]   File "/home/abuild/rpmbuild/BUILD/Python-3.10.0/Lib/unittest/suite.py", line 84 in __call__
[ 2318s]   File "/home/abuild/rpmbuild/BUILD/Python-3.10.0/Lib/unittest/suite.py", line 122 in run
[ 2318s]   File "/home/abuild/rpmbuild/BUILD/Python-3.10.0/Lib/unittest/suite.py", line 84 in __call__
[ 2318s]   File "/home/abuild/rpmbuild/BUILD/Python-3.10.0/Lib/unittest/suite.py", line 122 in run
[ 2318s]   File "/home/abuild/rpmbuild/BUILD/Python-3.10.0/Lib/unittest/suite.py", line 84 in __call__
[ 2318s]   File "/home/abuild/rpmbuild/BUILD/Python-3.10.0/Lib/unittest/runner.py", line 176 in run
[ 2318s]   File "/home/abuild/rpmbuild/BUILD/Python-3.10.0/Lib/test/support/__init__.py", line 990 in _run_suite
[ 2318s]   File "/home/abuild/rpmbuild/BUILD/Python-3.10.0/Lib/test/support/__init__.py", line 1115 in run_unittest
[ 2318s]   File "/home/abuild/rpmbuild/BUILD/Python-3.10.0/Lib/test/libregrtest/runtest.py", line 261 in _test_module
[ 2318s]   File "/home/abuild/rpmbuild/BUILD/Python-3.10.0/Lib/test/libregrtest/runtest.py", line 297 in _runtest_inner2
[ 2318s]   File "/home/abuild/rpmbuild/BUILD/Python-3.10.0/Lib/test/libregrtest/runtest.py", line 335 in _runtest_inner
[ 2318s]   File "/home/abuild/rpmbuild/BUILD/Python-3.10.0/Lib/test/libregrtest/runtest.py", line 215 in _runtest
[ 2318s]   File "/home/abuild/rpmbuild/BUILD/Python-3.10.0/Lib/test/libregrtest/runtest.py", line 245 in runtest
[ 2318s]   File "/home/abuild/rpmbuild/BUILD/Python-3.10.0/Lib/test/libregrtest/main.py", line 337 in rerun_failed_tests
[ 2318s]   File "/home/abuild/rpmbuild/BUILD/Python-3.10.0/Lib/test/libregrtest/main.py", line 715 in _main
[ 2318s]   File "/home/abuild/rpmbuild/BUILD/Python-3.10.0/Lib/test/libregrtest/main.py", line 658 in main
[ 2318s]   File "/home/abuild/rpmbuild/BUILD/Python-3.10.0/Lib/test/libregrtest/main.py", line 736 in main
[ 2318s]   File "/home/abuild/rpmbuild/BUILD/Python-3.10.0/Lib/test/regrtest.py", line 43 in _main
[ 2318s]   File "/home/abuild/rpmbuild/BUILD/Python-3.10.0/Lib/test/regrtest.py", line 47 in <module>
[ 2318s]   File "/home/abuild/rpmbuild/BUILD/Python-3.10.0/Lib/runpy.py", line 86 in _run_code
[ 2318s]   File "/home/abuild/rpmbuild/BUILD/Python-3.10.0/Lib/runpy.py", line 196 in _run_module_as_main
[ 2318s]
[ 2318s] 79.95s FAIL
[ 2398s] test_crash_during_func_exec_on_worker (test.test_concurrent_futures.ProcessPoolForkExecutorDeadlockTest) ...
[ 2398s] Traceback:
[ 2398s]  Thread 0x00007fbd57fff700 (most recent call first):
[ 2398s]   File "/home/abuild/rpmbuild/BUILD/Python-3.10.0/Lib/threading.py", line 320 in wait
[ 2398s]   File "/home/abuild/rpmbuild/BUILD/Python-3.10.0/Lib/multiprocessing/queues.py", line 233 in _feed
[ 2398s]   File "/home/abuild/rpmbuild/BUILD/Python-3.10.0/Lib/threading.py", line 946 in run
[ 2398s]   File "/home/abuild/rpmbuild/BUILD/Python-3.10.0/Lib/threading.py", line 1009 in _bootstrap_inner
[ 2398s]   File "/home/abuild/rpmbuild/BUILD/Python-3.10.0/Lib/threading.py", line 966 in _bootstrap
[ 2398s]
[ 2398s] Thread 0x00007fbd74ff9700 (most recent call first):
[ 2398s]   File "/home/abuild/rpmbuild/BUILD/Python-3.10.0/Lib/selectors.py", line 416 in select
[ 2398s]   File "/home/abuild/rpmbuild/BUILD/Python-3.10.0/Lib/multiprocessing/connection.py", line 936 in wait
[ 2398s]   File "/home/abuild/rpmbuild/BUILD/Python-3.10.0/Lib/concurrent/futures/process.py", line 377 in wait_result_broken_or_wakeup
[ 2398s]   File "/home/abuild/rpmbuild/BUILD/Python-3.10.0/Lib/concurrent/futures/process.py", line 317 in run
[ 2398s]   File "/home/abuild/rpmbuild/BUILD/Python-3.10.0/Lib/threading.py", line 1009 in _bootstrap_inner
[ 2398s]   File "/home/abuild/rpmbuild/BUILD/Python-3.10.0/Lib/threading.py", line 966 in _bootstrap
[ 2398s]
[ 2398s] Current thread 0x00007fbdae8ec740 (most recent call first):
[ 2398s]   File "/home/abuild/rpmbuild/BUILD/Python-3.10.0/Lib/test/test_concurrent_futures.py", line 1105 in _fail_on_deadlock
[ 2398s]   File "/home/abuild/rpmbuild/BUILD/Python-3.10.0/Lib/test/test_concurrent_futures.py", line 1137 in _check_crash
[ 2398s]   File "/home/abuild/rpmbuild/BUILD/Python-3.10.0/Lib/test/test_concurrent_futures.py", line 1159 in test_crash_during_func_exec_on_worker
[ 2398s]   File "/home/abuild/rpmbuild/BUILD/Python-3.10.0/Lib/unittest/case.py", line 549 in _callTestMethod
[ 2398s]   File "/home/abuild/rpmbuild/BUILD/Python-3.10.0/Lib/unittest/case.py", line 591 in run
[ 2398s]   File "/home/abuild/rpmbuild/BUILD/Python-3.10.0/Lib/unittest/case.py", line 650 in __call__
[ 2398s]   File "/home/abuild/rpmbuild/BUILD/Python-3.10.0/Lib/unittest/suite.py", line 122 in run
[ 2398s]   File "/home/abuild/rpmbuild/BUILD/Python-3.10.0/Lib/unittest/suite.py", line 84 in __call__
[ 2398s]   File "/home/abuild/rpmbuild/BUILD/Python-3.10.0/Lib/unittest/suite.py", line 122 in run
[ 2398s]   File "/home/abuild/rpmbuild/BUILD/Python-3.10.0/Lib/unittest/suite.py", line 84 in __call__
[ 2398s]   File "/home/abuild/rpmbuild/BUILD/Python-3.10.0/Lib/unittest/suite.py", line 122 in run
[ 2398s]   File "/home/abuild/rpmbuild/BUILD/Python-3.10.0/Lib/unittest/suite.py", line 84 in __call__
[ 2398s]   File "/home/abuild/rpmbuild/BUILD/Python-3.10.0/Lib/unittest/runner.py", line 176 in run
[ 2398s]   File "/home/abuild/rpmbuild/BUILD/Python-3.10.0/Lib/test/support/__init__.py", line 990 in _run_suite
[ 2398s]   File "/home/abuild/rpmbuild/BUILD/Python-3.10.0/Lib/test/support/__init__.py", line 1115 in run_unittest
[ 2398s]   File "/home/abuild/rpmbuild/BUILD/Python-3.10.0/Lib/test/libregrtest/runtest.py", line 261 in _test_module
[ 2398s]   File "/home/abuild/rpmbuild/BUILD/Python-3.10.0/Lib/test/libregrtest/runtest.py", line 297 in _runtest_inner2
[ 2398s]   File "/home/abuild/rpmbuild/BUILD/Python-3.10.0/Lib/test/libregrtest/runtest.py", line 335 in _runtest_inner
[ 2398s]   File "/home/abuild/rpmbuild/BUILD/Python-3.10.0/Lib/test/libregrtest/runtest.py", line 215 in _runtest
[ 2398s]   File "/home/abuild/rpmbuild/BUILD/Python-3.10.0/Lib/test/libregrtest/runtest.py", line 245 in runtest
[ 2398s]   File "/home/abuild/rpmbuild/BUILD/Python-3.10.0/Lib/test/libregrtest/main.py", line 337 in rerun_failed_tests
[ 2398s]   File "/home/abuild/rpmbuild/BUILD/Python-3.10.0/Lib/test/libregrtest/main.py", line 715 in _main
[ 2398s]   File "/home/abuild/rpmbuild/BUILD/Python-3.10.0/Lib/test/libregrtest/main.py", line 658 in main
[ 2398s]   File "/home/abuild/rpmbuild/BUILD/Python-3.10.0/Lib/test/libregrtest/main.py", line 736 in main
[ 2398s]   File "/home/abuild/rpmbuild/BUILD/Python-3.10.0/Lib/test/regrtest.py", line 43 in _main
[ 2398s]   File "/home/abuild/rpmbuild/BUILD/Python-3.10.0/Lib/test/regrtest.py", line 47 in <module>
[ 2398s]   File "/home/abuild/rpmbuild/BUILD/Python-3.10.0/Lib/runpy.py", line 86 in _run_code
[ 2398s]   File "/home/abuild/rpmbuild/BUILD/Python-3.10.0/Lib/runpy.py", line 196 in _run_module_as_main
[ 2398s]
[ 2398s] 80.54s FAIL
[ 2477s] test_crash_during_result_pickle_on_worker (test.test_concurrent_futures.ProcessPoolForkExecutorDeadlockTest) ...
[ 2477s] Traceback:
[ 2477s]  Thread 0x00007fbd57fff700 (most recent call first):
[ 2477s]   File "/home/abuild/rpmbuild/BUILD/Python-3.10.0/Lib/threading.py", line 320 in wait
[ 2477s]   File "/home/abuild/rpmbuild/BUILD/Python-3.10.0/Lib/multiprocessing/queues.py", line 233 in _feed
[ 2477s]   File "/home/abuild/rpmbuild/BUILD/Python-3.10.0/Lib/threading.py", line 946 in run
[ 2477s]   File "/home/abuild/rpmbuild/BUILD/Python-3.10.0/Lib/threading.py", line 1009 in _bootstrap_inner
[ 2477s]   File "/home/abuild/rpmbuild/BUILD/Python-3.10.0/Lib/threading.py", line 966 in _bootstrap
[ 2477s]
[ 2477s] Thread 0x00007fbd74ff9700 (most recent call first):
[ 2477s]   File "/home/abuild/rpmbuild/BUILD/Python-3.10.0/Lib/selectors.py", line 416 in select
[ 2477s]   File "/home/abuild/rpmbuild/BUILD/Python-3.10.0/Lib/multiprocessing/connection.py", line 936 in wait
[ 2477s]   File "/home/abuild/rpmbuild/BUILD/Python-3.10.0/Lib/concurrent/futures/process.py", line 377 in wait_result_broken_or_wakeup
[ 2477s]   File "/home/abuild/rpmbuild/BUILD/Python-3.10.0/Lib/concurrent/futures/process.py", line 317 in run
[ 2477s]   File "/home/abuild/rpmbuild/BUILD/Python-3.10.0/Lib/threading.py", line 1009 in _bootstrap_inner
[ 2477s]   File "/home/abuild/rpmbuild/BUILD/Python-3.10.0/Lib/threading.py", line 966 in _bootstrap
[ 2477s]
[ 2477s] Current thread 0x00007fbdae8ec740 (most recent call first):
[ 2477s]   File "/home/abuild/rpmbuild/BUILD/Python-3.10.0/Lib/test/test_concurrent_futures.py", line 1105 in _fail_on_deadlock
[ 2477s]   File "/home/abuild/rpmbuild/BUILD/Python-3.10.0/Lib/test/test_concurrent_futures.py", line 1137 in _check_crash
[ 2477s]   File "/home/abuild/rpmbuild/BUILD/Python-3.10.0/Lib/test/test_concurrent_futures.py", line 1172 in test_crash_during_result_pickle_on_worker
[ 2477s]   File "/home/abuild/rpmbuild/BUILD/Python-3.10.0/Lib/unittest/case.py", line 549 in _callTestMethod
[ 2477s]   File "/home/abuild/rpmbuild/BUILD/Python-3.10.0/Lib/unittest/case.py", line 591 in run
[ 2477s]   File "/home/abuild/rpmbuild/BUILD/Python-3.10.0/Lib/unittest/case.py", line 650 in __call__
[ 2477s]   File "/home/abuild/rpmbuild/BUILD/Python-3.10.0/Lib/unittest/suite.py", line 122 in run
[ 2477s]   File "/home/abuild/rpmbuild/BUILD/Python-3.10.0/Lib/unittest/suite.py", line 84 in __call__
[ 2477s]   File "/home/abuild/rpmbuild/BUILD/Python-3.10.0/Lib/unittest/suite.py", line 122 in run
[ 2477s]   File "/home/abuild/rpmbuild/BUILD/Python-3.10.0/Lib/unittest/suite.py", line 84 in __call__
[ 2477s]   File "/home/abuild/rpmbuild/BUILD/Python-3.10.0/Lib/unittest/suite.py", line 122 in run
[ 2477s]   File "/home/abuild/rpmbuild/BUILD/Python-3.10.0/Lib/unittest/suite.py", line 84 in __call__
[ 2477s]   File "/home/abuild/rpmbuild/BUILD/Python-3.10.0/Lib/unittest/runner.py", line 176 in run
[ 2477s]   File "/home/abuild/rpmbuild/BUILD/Python-3.10.0/Lib/test/support/__init__.py", line 990 in _run_suite
[ 2477s]   File "/home/abuild/rpmbuild/BUILD/Python-3.10.0/Lib/test/support/__init__.py", line 1115 in run_unittest
[ 2477s]   File "/home/abuild/rpmbuild/BUILD/Python-3.10.0/Lib/test/libregrtest/runtest.py", line 261 in _test_module
[ 2477s]   File "/home/abuild/rpmbuild/BUILD/Python-3.10.0/Lib/test/libregrtest/runtest.py", line 297 in _runtest_inner2
[ 2477s]   File "/home/abuild/rpmbuild/BUILD/Python-3.10.0/Lib/test/libregrtest/runtest.py", line 335 in _runtest_inner
[ 2477s]   File "/home/abuild/rpmbuild/BUILD/Python-3.10.0/Lib/test/libregrtest/runtest.py", line 215 in _runtest
[ 2477s]   File "/home/abuild/rpmbuild/BUILD/Python-3.10.0/Lib/test/libregrtest/runtest.py", line 245 in runtest
[ 2477s]   File "/home/abuild/rpmbuild/BUILD/Python-3.10.0/Lib/test/libregrtest/main.py", line 337 in rerun_failed_tests
[ 2477s]   File "/home/abuild/rpmbuild/BUILD/Python-3.10.0/Lib/test/libregrtest/main.py", line 715 in _main
[ 2477s]   File "/home/abuild/rpmbuild/BUILD/Python-3.10.0/Lib/test/libregrtest/main.py", line 658 in main
[ 2477s]   File "/home/abuild/rpmbuild/BUILD/Python-3.10.0/Lib/test/libregrtest/main.py", line 736 in main
[ 2477s]   File "/home/abuild/rpmbuild/BUILD/Python-3.10.0/Lib/test/regrtest.py", line 43 in _main
[ 2477s]   File "/home/abuild/rpmbuild/BUILD/Python-3.10.0/Lib/test/regrtest.py", line 47 in <module>
[ 2477s]   File "/home/abuild/rpmbuild/BUILD/Python-3.10.0/Lib/runpy.py", line 86 in _run_code
[ 2477s]   File "/home/abuild/rpmbuild/BUILD/Python-3.10.0/Lib/runpy.py", line 196 in _run_module_as_main
[ 2477s]
[ 2477s] 78.53s FAIL
[ 2554s] test_crash_at_task_unpickle (test.test_concurrent_futures.ProcessPoolForkserverExecutorDeadlockTest) ...
[ 2554s] Traceback:
[ 2554s]  Thread 0x00007fbd57fff700 (most recent call first):
[ 2554s]   File "/home/abuild/rpmbuild/BUILD/Python-3.10.0/Lib/threading.py", line 320 in wait
[ 2554s]   File "/home/abuild/rpmbuild/BUILD/Python-3.10.0/Lib/multiprocessing/queues.py", line 233 in _feed
[ 2554s]   File "/home/abuild/rpmbuild/BUILD/Python-3.10.0/Lib/threading.py", line 946 in run
[ 2554s]   File "/home/abuild/rpmbuild/BUILD/Python-3.10.0/Lib/threading.py", line 1009 in _bootstrap_inner
[ 2554s]   File "/home/abuild/rpmbuild/BUILD/Python-3.10.0/Lib/threading.py", line 966 in _bootstrap
[ 2554s]
[ 2554s] Thread 0x00007fbd74ff9700 (most recent call first):
[ 2554s]   File "/home/abuild/rpmbuild/BUILD/Python-3.10.0/Lib/selectors.py", line 416 in select
[ 2554s]   File "/home/abuild/rpmbuild/BUILD/Python-3.10.0/Lib/multiprocessing/connection.py", line 936 in wait
[ 2554s]   File "/home/abuild/rpmbuild/BUILD/Python-3.10.0/Lib/concurrent/futures/process.py", line 377 in wait_result_broken_or_wakeup
[ 2554s]   File "/home/abuild/rpmbuild/BUILD/Python-3.10.0/Lib/concurrent/futures/process.py", line 317 in run
[ 2554s]   File "/home/abuild/rpmbuild/BUILD/Python-3.10.0/Lib/threading.py", line 1009 in _bootstrap_inner
[ 2554s]   File "/home/abuild/rpmbuild/BUILD/Python-3.10.0/Lib/threading.py", line 966 in _bootstrap
[ 2554s]
[ 2554s] Current thread 0x00007fbdae8ec740 (most recent call first):
[ 2554s]   File "/home/abuild/rpmbuild/BUILD/Python-3.10.0/Lib/test/test_concurrent_futures.py", line 1105 in _fail_on_deadlock
[ 2554s]   File "/home/abuild/rpmbuild/BUILD/Python-3.10.0/Lib/test/test_concurrent_futures.py", line 1137 in _check_crash
[ 2554s]   File "/home/abuild/rpmbuild/BUILD/Python-3.10.0/Lib/test/test_concurrent_futures.py", line 1155 in test_crash_at_task_unpickle
[ 2554s]   File "/home/abuild/rpmbuild/BUILD/Python-3.10.0/Lib/unittest/case.py", line 549 in _callTestMethod
[ 2554s]   File "/home/abuild/rpmbuild/BUILD/Python-3.10.0/Lib/unittest/case.py", line 591 in run
[ 2554s]   File "/home/abuild/rpmbuild/BUILD/Python-3.10.0/Lib/unittest/case.py", line 650 in __call__
[ 2554s]   File "/home/abuild/rpmbuild/BUILD/Python-3.10.0/Lib/unittest/suite.py", line 122 in run
[ 2554s]   File "/home/abuild/rpmbuild/BUILD/Python-3.10.0/Lib/unittest/suite.py", line 84 in __call__
[ 2554s]   File "/home/abuild/rpmbuild/BUILD/Python-3.10.0/Lib/unittest/suite.py", line 122 in run
[ 2554s]   File "/home/abuild/rpmbuild/BUILD/Python-3.10.0/Lib/unittest/suite.py", line 84 in __call__
[ 2554s]   File "/home/abuild/rpmbuild/BUILD/Python-3.10.0/Lib/unittest/suite.py", line 122 in run
[ 2554s]   File "/home/abuild/rpmbuild/BUILD/Python-3.10.0/Lib/unittest/suite.py", line 84 in __call__
[ 2554s]   File "/home/abuild/rpmbuild/BUILD/Python-3.10.0/Lib/unittest/runner.py", line 176 in run
[ 2554s]   File "/home/abuild/rpmbuild/BUILD/Python-3.10.0/Lib/test/support/__init__.py", line 990 in _run_suite
[ 2554s]   File "/home/abuild/rpmbuild/BUILD/Python-3.10.0/Lib/test/support/__init__.py", line 1115 in run_unittest
[ 2554s]   File "/home/abuild/rpmbuild/BUILD/Python-3.10.0/Lib/test/libregrtest/runtest.py", line 261 in _test_module
[ 2554s]   File "/home/abuild/rpmbuild/BUILD/Python-3.10.0/Lib/test/libregrtest/runtest.py", line 297 in _runtest_inner2
[ 2554s]   File "/home/abuild/rpmbuild/BUILD/Python-3.10.0/Lib/test/libregrtest/runtest.py", line 335 in _runtest_inner
[ 2554s]   File "/home/abuild/rpmbuild/BUILD/Python-3.10.0/Lib/test/libregrtest/runtest.py", line 215 in _runtest
[ 2554s]   File "/home/abuild/rpmbuild/BUILD/Python-3.10.0/Lib/test/libregrtest/runtest.py", line 245 in runtest
[ 2554s]   File "/home/abuild/rpmbuild/BUILD/Python-3.10.0/Lib/test/libregrtest/main.py", line 337 in rerun_failed_tests
[ 2554s]   File "/home/abuild/rpmbuild/BUILD/Python-3.10.0/Lib/test/libregrtest/main.py", line 715 in _main
[ 2554s]   File "/home/abuild/rpmbuild/BUILD/Python-3.10.0/Lib/test/libregrtest/main.py", line 658 in main
[ 2554s]   File "/home/abuild/rpmbuild/BUILD/Python-3.10.0/Lib/test/libregrtest/main.py", line 736 in main
[ 2554s]   File "/home/abuild/rpmbuild/BUILD/Python-3.10.0/Lib/test/regrtest.py", line 43 in _main
[ 2554s]   File "/home/abuild/rpmbuild/BUILD/Python-3.10.0/Lib/test/regrtest.py", line 47 in <module>
[ 2554s]   File "/home/abuild/rpmbuild/BUILD/Python-3.10.0/Lib/runpy.py", line 86 in _run_code
[ 2554s]   File "/home/abuild/rpmbuild/BUILD/Python-3.10.0/Lib/runpy.py", line 196 in _run_module_as_main
[ 2554s]
[ 2554s] 76.82s FAIL
[ 2631s] test_crash_during_func_exec_on_worker (test.test_concurrent_futures.ProcessPoolForkserverExecutorDeadlockTest) ...
[ 2631s] Traceback:
[ 2631s]  Thread 0x00007fbd57fff700 (most recent call first):
[ 2631s]   File "/home/abuild/rpmbuild/BUILD/Python-3.10.0/Lib/threading.py", line 320 in wait
[ 2631s]   File "/home/abuild/rpmbuild/BUILD/Python-3.10.0/Lib/multiprocessing/queues.py", line 233 in _feed
[ 2631s]   File "/home/abuild/rpmbuild/BUILD/Python-3.10.0/Lib/threading.py", line 946 in run
[ 2631s]   File "/home/abuild/rpmbuild/BUILD/Python-3.10.0/Lib/threading.py", line 1009 in _bootstrap_inner
[ 2631s]   File "/home/abuild/rpmbuild/BUILD/Python-3.10.0/Lib/threading.py", line 966 in _bootstrap
[ 2631s]
[ 2631s] Thread 0x00007fbd74ff9700 (most recent call first):
[ 2631s]   File "/home/abuild/rpmbuild/BUILD/Python-3.10.0/Lib/selectors.py", line 416 in select
[ 2631s]   File "/home/abuild/rpmbuild/BUILD/Python-3.10.0/Lib/multiprocessing/connection.py", line 936 in wait
[ 2631s]   File "/home/abuild/rpmbuild/BUILD/Python-3.10.0/Lib/concurrent/futures/process.py", line 377 in wait_result_broken_or_wakeup
[ 2631s]   File "/home/abuild/rpmbuild/BUILD/Python-3.10.0/Lib/concurrent/futures/process.py", line 317 in run
[ 2631s]   File "/home/abuild/rpmbuild/BUILD/Python-3.10.0/Lib/threading.py", line 1009 in _bootstrap_inner
[ 2631s]   File "/home/abuild/rpmbuild/BUILD/Python-3.10.0/Lib/threading.py", line 966 in _bootstrap
[ 2631s]
[ 2631s] Current thread 0x00007fbdae8ec740 (most recent call first):
[ 2631s]   File "/home/abuild/rpmbuild/BUILD/Python-3.10.0/Lib/test/test_concurrent_futures.py", line 1105 in _fail_on_deadlock
[ 2631s]   File "/home/abuild/rpmbuild/BUILD/Python-3.10.0/Lib/test/test_concurrent_futures.py", line 1137 in _check_crash
[ 2631s]   File "/home/abuild/rpmbuild/BUILD/Python-3.10.0/Lib/test/test_concurrent_futures.py", line 1159 in test_crash_during_func_exec_on_worker
[ 2631s]   File "/home/abuild/rpmbuild/BUILD/Python-3.10.0/Lib/unittest/case.py", line 549 in _callTestMethod
[ 2631s]   File "/home/abuild/rpmbuild/BUILD/Python-3.10.0/Lib/unittest/case.py", line 591 in run
[ 2631s]   File "/home/abuild/rpmbuild/BUILD/Python-3.10.0/Lib/unittest/case.py", line 650 in __call__
[ 2631s]   File "/home/abuild/rpmbuild/BUILD/Python-3.10.0/Lib/unittest/suite.py", line 122 in run
[ 2631s]   File "/home/abuild/rpmbuild/BUILD/Python-3.10.0/Lib/unittest/suite.py", line 84 in __call__
[ 2631s]   File "/home/abuild/rpmbuild/BUILD/Python-3.10.0/Lib/unittest/suite.py", line 122 in run
[ 2631s]   File "/home/abuild/rpmbuild/BUILD/Python-3.10.0/Lib/unittest/suite.py", line 84 in __call__
[ 2631s]   File "/home/abuild/rpmbuild/BUILD/Python-3.10.0/Lib/unittest/suite.py", line 122 in run
[ 2631s]   File "/home/abuild/rpmbuild/BUILD/Python-3.10.0/Lib/unittest/suite.py", line 84 in __call__
[ 2631s]   File "/home/abuild/rpmbuild/BUILD/Python-3.10.0/Lib/unittest/runner.py", line 176 in run
[ 2631s]   File "/home/abuild/rpmbuild/BUILD/Python-3.10.0/Lib/test/support/__init__.py", line 990 in _run_suite
[ 2631s]   File "/home/abuild/rpmbuild/BUILD/Python-3.10.0/Lib/test/support/__init__.py", line 1115 in run_unittest
[ 2631s]   File "/home/abuild/rpmbuild/BUILD/Python-3.10.0/Lib/test/libregrtest/runtest.py", line 261 in _test_module
[ 2631s]   File "/home/abuild/rpmbuild/BUILD/Python-3.10.0/Lib/test/libregrtest/runtest.py", line 297 in _runtest_inner2
[ 2631s]   File "/home/abuild/rpmbuild/BUILD/Python-3.10.0/Lib/test/libregrtest/runtest.py", line 335 in _runtest_inner
[ 2631s]   File "/home/abuild/rpmbuild/BUILD/Python-3.10.0/Lib/test/libregrtest/runtest.py", line 215 in _runtest
[ 2631s]   File "/home/abuild/rpmbuild/BUILD/Python-3.10.0/Lib/test/libregrtest/runtest.py", line 245 in runtest
[ 2631s]   File "/home/abuild/rpmbuild/BUILD/Python-3.10.0/Lib/test/libregrtest/main.py", line 337 in rerun_failed_tests
[ 2631s]   File "/home/abuild/rpmbuild/BUILD/Python-3.10.0/Lib/test/libregrtest/main.py", line 715 in _main
[ 2631s]   File "/home/abuild/rpmbuild/BUILD/Python-3.10.0/Lib/test/libregrtest/main.py", line 658 in main
[ 2631s]   File "/home/abuild/rpmbuild/BUILD/Python-3.10.0/Lib/test/libregrtest/main.py", line 736 in main
[ 2631s]   File "/home/abuild/rpmbuild/BUILD/Python-3.10.0/Lib/test/regrtest.py", line 43 in _main
[ 2631s]   File "/home/abuild/rpmbuild/BUILD/Python-3.10.0/Lib/test/regrtest.py", line 47 in <module>
[ 2631s]   File "/home/abuild/rpmbuild/BUILD/Python-3.10.0/Lib/runpy.py", line 86 in _run_code
[ 2631s]   File "/home/abuild/rpmbuild/BUILD/Python-3.10.0/Lib/runpy.py", line 196 in _run_module_as_main
[ 2631s]
[ 2631s] 77.49s FAIL
[ 2706s] test_crash_during_result_pickle_on_worker (test.test_concurrent_futures.ProcessPoolForkserverExecutorDeadlockTest) ...
[ 2706s] Traceback:
[ 2706s]  Thread 0x00007fbd57fff700 (most recent call first):
[ 2706s]   File "/home/abuild/rpmbuild/BUILD/Python-3.10.0/Lib/threading.py", line 320 in wait
[ 2706s]   File "/home/abuild/rpmbuild/BUILD/Python-3.10.0/Lib/multiprocessing/queues.py", line 233 in _feed
[ 2706s]   File "/home/abuild/rpmbuild/BUILD/Python-3.10.0/Lib/threading.py", line 946 in run
[ 2706s]   File "/home/abuild/rpmbuild/BUILD/Python-3.10.0/Lib/threading.py", line 1009 in _bootstrap_inner
[ 2706s]   File "/home/abuild/rpmbuild/BUILD/Python-3.10.0/Lib/threading.py", line 966 in _bootstrap
[ 2706s]
[ 2706s] Thread 0x00007fbd74ff9700 (most recent call first):
[ 2706s]   File "/home/abuild/rpmbuild/BUILD/Python-3.10.0/Lib/selectors.py", line 416 in select
[ 2706s]   File "/home/abuild/rpmbuild/BUILD/Python-3.10.0/Lib/multiprocessing/connection.py", line 936 in wait
[ 2706s]   File "/home/abuild/rpmbuild/BUILD/Python-3.10.0/Lib/concurrent/futures/process.py", line 377 in wait_result_broken_or_wakeup
[ 2706s]   File "/home/abuild/rpmbuild/BUILD/Python-3.10.0/Lib/concurrent/futures/process.py", line 317 in run
[ 2706s]   File "/home/abuild/rpmbuild/BUILD/Python-3.10.0/Lib/threading.py", line 1009 in _bootstrap_inner
[ 2706s]   File "/home/abuild/rpmbuild/BUILD/Python-3.10.0/Lib/threading.py", line 966 in _bootstrap
[ 2706s]
[ 2706s] Current thread 0x00007fbdae8ec740 (most recent call first):
[ 2706s]   File "/home/abuild/rpmbuild/BUILD/Python-3.10.0/Lib/test/test_concurrent_futures.py", line 1105 in _fail_on_deadlock
[ 2706s]   File "/home/abuild/rpmbuild/BUILD/Python-3.10.0/Lib/test/test_concurrent_futures.py", line 1137 in _check_crash
[ 2706s]   File "/home/abuild/rpmbuild/BUILD/Python-3.10.0/Lib/test/test_concurrent_futures.py", line 1172 in test_crash_during_result_pickle_on_worker
[ 2706s]   File "/home/abuild/rpmbuild/BUILD/Python-3.10.0/Lib/unittest/case.py", line 549 in _callTestMethod
[ 2706s]   File "/home/abuild/rpmbuild/BUILD/Python-3.10.0/Lib/unittest/case.py", line 591 in run
[ 2706s]   File "/home/abuild/rpmbuild/BUILD/Python-3.10.0/Lib/unittest/case.py", line 650 in __call__
[ 2706s]   File "/home/abuild/rpmbuild/BUILD/Python-3.10.0/Lib/unittest/suite.py", line 122 in run
[ 2706s]   File "/home/abuild/rpmbuild/BUILD/Python-3.10.0/Lib/unittest/suite.py", line 84 in __call__
[ 2706s]   File "/home/abuild/rpmbuild/BUILD/Python-3.10.0/Lib/unittest/suite.py", line 122 in run
[ 2706s]   File "/home/abuild/rpmbuild/BUILD/Python-3.10.0/Lib/unittest/suite.py", line 84 in __call__
[ 2706s]   File "/home/abuild/rpmbuild/BUILD/Python-3.10.0/Lib/unittest/suite.py", line 122 in run
[ 2706s]   File "/home/abuild/rpmbuild/BUILD/Python-3.10.0/Lib/unittest/suite.py", line 84 in __call__
[ 2706s]   File "/home/abuild/rpmbuild/BUILD/Python-3.10.0/Lib/unittest/runner.py", line 176 in run
[ 2706s]   File "/home/abuild/rpmbuild/BUILD/Python-3.10.0/Lib/test/support/__init__.py", line 990 in _run_suite
[ 2706s]   File "/home/abuild/rpmbuild/BUILD/Python-3.10.0/Lib/test/support/__init__.py", line 1115 in run_unittest
[ 2706s]   File "/home/abuild/rpmbuild/BUILD/Python-3.10.0/Lib/test/libregrtest/runtest.py", line 261 in _test_module
[ 2706s]   File "/home/abuild/rpmbuild/BUILD/Python-3.10.0/Lib/test/libregrtest/runtest.py", line 297 in _runtest_inner2
[ 2706s]   File "/home/abuild/rpmbuild/BUILD/Python-3.10.0/Lib/test/libregrtest/runtest.py", line 335 in _runtest_inner
[ 2706s]   File "/home/abuild/rpmbuild/BUILD/Python-3.10.0/Lib/test/libregrtest/runtest.py", line 215 in _runtest
[ 2706s]   File "/home/abuild/rpmbuild/BUILD/Python-3.10.0/Lib/test/libregrtest/runtest.py", line 245 in runtest
[ 2706s]   File "/home/abuild/rpmbuild/BUILD/Python-3.10.0/Lib/test/libregrtest/main.py", line 337 in rerun_failed_tests
[ 2706s]   File "/home/abuild/rpmbuild/BUILD/Python-3.10.0/Lib/test/libregrtest/main.py", line 715 in _main
[ 2706s]   File "/home/abuild/rpmbuild/BUILD/Python-3.10.0/Lib/test/libregrtest/main.py", line 658 in main
[ 2706s]   File "/home/abuild/rpmbuild/BUILD/Python-3.10.0/Lib/test/libregrtest/main.py", line 736 in main
[ 2706s]   File "/home/abuild/rpmbuild/BUILD/Python-3.10.0/Lib/test/regrtest.py", line 43 in _main
[ 2706s]   File "/home/abuild/rpmbuild/BUILD/Python-3.10.0/Lib/test/regrtest.py", line 47 in <module>
[ 2706s]   File "/home/abuild/rpmbuild/BUILD/Python-3.10.0/Lib/runpy.py", line 86 in _run_code
[ 2706s]   File "/home/abuild/rpmbuild/BUILD/Python-3.10.0/Lib/runpy.py", line 196 in _run_module_as_main
[ 2706s]
[ 2706s] 75.22s FAIL
[ 2782s] test_crash_at_task_unpickle (test.test_concurrent_futures.ProcessPoolSpawnExecutorDeadlockTest) ...
[ 2782s] Traceback:
[ 2782s]  Thread 0x00007fbd57fff700 (most recent call first):
[ 2782s]   File "/home/abuild/rpmbuild/BUILD/Python-3.10.0/Lib/threading.py", line 320 in wait
[ 2782s]   File "/home/abuild/rpmbuild/BUILD/Python-3.10.0/Lib/multiprocessing/queues.py", line 233 in _feed
[ 2782s]   File "/home/abuild/rpmbuild/BUILD/Python-3.10.0/Lib/threading.py", line 946 in run
[ 2782s]   File "/home/abuild/rpmbuild/BUILD/Python-3.10.0/Lib/threading.py", line 1009 in _bootstrap_inner
[ 2782s]   File "/home/abuild/rpmbuild/BUILD/Python-3.10.0/Lib/threading.py", line 966 in _bootstrap
[ 2782s]
[ 2782s] Thread 0x00007fbd74ff9700 (most recent call first):
[ 2782s]   File "/home/abuild/rpmbuild/BUILD/Python-3.10.0/Lib/selectors.py", line 416 in select
[ 2782s]   File "/home/abuild/rpmbuild/BUILD/Python-3.10.0/Lib/multiprocessing/connection.py", line 936 in wait
[ 2782s]   File "/home/abuild/rpmbuild/BUILD/Python-3.10.0/Lib/concurrent/futures/process.py", line 377 in wait_result_broken_or_wakeup
[ 2782s]   File "/home/abuild/rpmbuild/BUILD/Python-3.10.0/Lib/concurrent/futures/process.py", line 317 in run
[ 2782s]   File "/home/abuild/rpmbuild/BUILD/Python-3.10.0/Lib/threading.py", line 1009 in _bootstrap_inner
[ 2782s]   File "/home/abuild/rpmbuild/BUILD/Python-3.10.0/Lib/threading.py", line 966 in _bootstrap
[ 2782s]
[ 2782s] Current thread 0x00007fbdae8ec740 (most recent call first):
[ 2782s]   File "/home/abuild/rpmbuild/BUILD/Python-3.10.0/Lib/test/test_concurrent_futures.py", line 1105 in _fail_on_deadlock
[ 2782s]   File "/home/abuild/rpmbuild/BUILD/Python-3.10.0/Lib/test/test_concurrent_futures.py", line 1137 in _check_crash
[ 2782s]   File "/home/abuild/rpmbuild/BUILD/Python-3.10.0/Lib/test/test_concurrent_futures.py", line 1155 in test_crash_at_task_unpickle
[ 2782s]   File "/home/abuild/rpmbuild/BUILD/Python-3.10.0/Lib/unittest/case.py", line 549 in _callTestMethod
[ 2782s]   File "/home/abuild/rpmbuild/BUILD/Python-3.10.0/Lib/unittest/case.py", line 591 in run
[ 2782s]   File "/home/abuild/rpmbuild/BUILD/Python-3.10.0/Lib/unittest/case.py", line 650 in __call__
[ 2782s]   File "/home/abuild/rpmbuild/BUILD/Python-3.10.0/Lib/unittest/suite.py", line 122 in run
[ 2782s]   File "/home/abuild/rpmbuild/BUILD/Python-3.10.0/Lib/unittest/suite.py", line 84 in __call__
[ 2782s]   File "/home/abuild/rpmbuild/BUILD/Python-3.10.0/Lib/unittest/suite.py", line 122 in run
[ 2782s]   File "/home/abuild/rpmbuild/BUILD/Python-3.10.0/Lib/unittest/suite.py", line 84 in __call__
[ 2782s]   File "/home/abuild/rpmbuild/BUILD/Python-3.10.0/Lib/unittest/suite.py", line 122 in run
[ 2782s]   File "/home/abuild/rpmbuild/BUILD/Python-3.10.0/Lib/unittest/suite.py", line 84 in __call__
[ 2782s]   File "/home/abuild/rpmbuild/BUILD/Python-3.10.0/Lib/unittest/runner.py", line 176 in run
[ 2782s]   File "/home/abuild/rpmbuild/BUILD/Python-3.10.0/Lib/test/support/__init__.py", line 990 in _run_suite
[ 2782s]   File "/home/abuild/rpmbuild/BUILD/Python-3.10.0/Lib/test/support/__init__.py", line 1115 in run_unittest
[ 2782s]   File "/home/abuild/rpmbuild/BUILD/Python-3.10.0/Lib/test/libregrtest/runtest.py", line 261 in _test_module
[ 2782s]   File "/home/abuild/rpmbuild/BUILD/Python-3.10.0/Lib/test/libregrtest/runtest.py", line 297 in _runtest_inner2
[ 2782s]   File "/home/abuild/rpmbuild/BUILD/Python-3.10.0/Lib/test/libregrtest/runtest.py", line 335 in _runtest_inner
[ 2782s]   File "/home/abuild/rpmbuild/BUILD/Python-3.10.0/Lib/test/libregrtest/runtest.py", line 215 in _runtest
[ 2782s]   File "/home/abuild/rpmbuild/BUILD/Python-3.10.0/Lib/test/libregrtest/runtest.py", line 245 in runtest
[ 2782s]   File "/home/abuild/rpmbuild/BUILD/Python-3.10.0/Lib/test/libregrtest/main.py", line 337 in rerun_failed_tests
[ 2782s]   File "/home/abuild/rpmbuild/BUILD/Python-3.10.0/Lib/test/libregrtest/main.py", line 715 in _main
[ 2782s]   File "/home/abuild/rpmbuild/BUILD/Python-3.10.0/Lib/test/libregrtest/main.py", line 658 in main
[ 2782s]   File "/home/abuild/rpmbuild/BUILD/Python-3.10.0/Lib/test/libregrtest/main.py", line 736 in main
[ 2782s]   File "/home/abuild/rpmbuild/BUILD/Python-3.10.0/Lib/test/regrtest.py", line 43 in _main
[ 2782s]   File "/home/abuild/rpmbuild/BUILD/Python-3.10.0/Lib/test/regrtest.py", line 47 in <module>
[ 2782s]   File "/home/abuild/rpmbuild/BUILD/Python-3.10.0/Lib/runpy.py", line 86 in _run_code
[ 2782s]   File "/home/abuild/rpmbuild/BUILD/Python-3.10.0/Lib/runpy.py", line 196 in _run_module_as_main
[ 2782s]
[ 2782s] 75.96s FAIL
[ 2858s] test_crash_during_func_exec_on_worker (test.test_concurrent_futures.ProcessPoolSpawnExecutorDeadlockTest) ...
[ 2858s] Traceback:
[ 2858s]  Thread 0x00007fbd57fff700 (most recent call first):
[ 2858s]   File "/home/abuild/rpmbuild/BUILD/Python-3.10.0/Lib/threading.py", line 320 in wait
[ 2858s]   File "/home/abuild/rpmbuild/BUILD/Python-3.10.0/Lib/multiprocessing/queues.py", line 233 in _feed
[ 2858s]   File "/home/abuild/rpmbuild/BUILD/Python-3.10.0/Lib/threading.py", line 946 in run
[ 2858s]   File "/home/abuild/rpmbuild/BUILD/Python-3.10.0/Lib/threading.py", line 1009 in _bootstrap_inner
[ 2858s]   File "/home/abuild/rpmbuild/BUILD/Python-3.10.0/Lib/threading.py", line 966 in _bootstrap
[ 2858s]
[ 2858s] Thread 0x00007fbd74ff9700 (most recent call first):
[ 2858s]   File "/home/abuild/rpmbuild/BUILD/Python-3.10.0/Lib/selectors.py", line 416 in select
[ 2858s]   File "/home/abuild/rpmbuild/BUILD/Python-3.10.0/Lib/multiprocessing/connection.py", line 936 in wait
[ 2858s]   File "/home/abuild/rpmbuild/BUILD/Python-3.10.0/Lib/concurrent/futures/process.py", line 377 in wait_result_broken_or_wakeup
[ 2858s]   File "/home/abuild/rpmbuild/BUILD/Python-3.10.0/Lib/concurrent/futures/process.py", line 317 in run
[ 2858s]   File "/home/abuild/rpmbuild/BUILD/Python-3.10.0/Lib/threading.py", line 1009 in _bootstrap_inner
[ 2858s]   File "/home/abuild/rpmbuild/BUILD/Python-3.10.0/Lib/threading.py", line 966 in _bootstrap
[ 2858s]
[ 2858s] Current thread 0x00007fbdae8ec740 (most recent call first):
[ 2858s]   File "/home/abuild/rpmbuild/BUILD/Python-3.10.0/Lib/test/test_concurrent_futures.py", line 1105 in _fail_on_deadlock
[ 2858s]   File "/home/abuild/rpmbuild/BUILD/Python-3.10.0/Lib/test/test_concurrent_futures.py", line 1137 in _check_crash
[ 2858s]   File "/home/abuild/rpmbuild/BUILD/Python-3.10.0/Lib/test/test_concurrent_futures.py", line 1159 in test_crash_during_func_exec_on_worker
[ 2858s]   File "/home/abuild/rpmbuild/BUILD/Python-3.10.0/Lib/unittest/case.py", line 549 in _callTestMethod
[ 2858s]   File "/home/abuild/rpmbuild/BUILD/Python-3.10.0/Lib/unittest/case.py", line 591 in run
[ 2858s]   File "/home/abuild/rpmbuild/BUILD/Python-3.10.0/Lib/unittest/case.py", line 650 in __call__
[ 2858s]   File "/home/abuild/rpmbuild/BUILD/Python-3.10.0/Lib/unittest/suite.py", line 122 in run
[ 2858s]   File "/home/abuild/rpmbuild/BUILD/Python-3.10.0/Lib/unittest/suite.py", line 84 in __call__
[ 2858s]   File "/home/abuild/rpmbuild/BUILD/Python-3.10.0/Lib/unittest/suite.py", line 122 in run
[ 2858s]   File "/home/abuild/rpmbuild/BUILD/Python-3.10.0/Lib/unittest/suite.py", line 84 in __call__
[ 2858s]   File "/home/abuild/rpmbuild/BUILD/Python-3.10.0/Lib/unittest/suite.py", line 122 in run
[ 2858s]   File "/home/abuild/rpmbuild/BUILD/Python-3.10.0/Lib/unittest/suite.py", line 84 in __call__
[ 2858s]   File "/home/abuild/rpmbuild/BUILD/Python-3.10.0/Lib/unittest/runner.py", line 176 in run
[ 2858s]   File "/home/abuild/rpmbuild/BUILD/Python-3.10.0/Lib/test/support/__init__.py", line 990 in _run_suite
[ 2858s]   File "/home/abuild/rpmbuild/BUILD/Python-3.10.0/Lib/test/support/__init__.py", line 1115 in run_unittest
[ 2858s]   File "/home/abuild/rpmbuild/BUILD/Python-3.10.0/Lib/test/libregrtest/runtest.py", line 261 in _test_module
[ 2858s]   File "/home/abuild/rpmbuild/BUILD/Python-3.10.0/Lib/test/libregrtest/runtest.py", line 297 in _runtest_inner2
[ 2858s]   File "/home/abuild/rpmbuild/BUILD/Python-3.10.0/Lib/test/libregrtest/runtest.py", line 335 in _runtest_inner
[ 2858s]   File "/home/abuild/rpmbuild/BUILD/Python-3.10.0/Lib/test/libregrtest/runtest.py", line 215 in _runtest
[ 2858s]   File "/home/abuild/rpmbuild/BUILD/Python-3.10.0/Lib/test/libregrtest/runtest.py", line 245 in runtest
[ 2858s]   File "/home/abuild/rpmbuild/BUILD/Python-3.10.0/Lib/test/libregrtest/main.py", line 337 in rerun_failed_tests
[ 2858s]   File "/home/abuild/rpmbuild/BUILD/Python-3.10.0/Lib/test/libregrtest/main.py", line 715 in _main
[ 2858s]   File "/home/abuild/rpmbuild/BUILD/Python-3.10.0/Lib/test/libregrtest/main.py", line 658 in main
[ 2858s]   File "/home/abuild/rpmbuild/BUILD/Python-3.10.0/Lib/test/libregrtest/main.py", line 736 in main
[ 2858s]   File "/home/abuild/rpmbuild/BUILD/Python-3.10.0/Lib/test/regrtest.py", line 43 in _main
[ 2858s]   File "/home/abuild/rpmbuild/BUILD/Python-3.10.0/Lib/test/regrtest.py", line 47 in <module>
[ 2858s]   File "/home/abuild/rpmbuild/BUILD/Python-3.10.0/Lib/runpy.py", line 86 in _run_code
[ 2858s]   File "/home/abuild/rpmbuild/BUILD/Python-3.10.0/Lib/runpy.py", line 196 in _run_module_as_main
[ 2858s]
[ 2858s] 76.14s FAIL
[ 2935s] test_crash_during_result_pickle_on_worker (test.test_concurrent_futures.ProcessPoolSpawnExecutorDeadlockTest) ...
[ 2935s] Traceback:
[ 2935s]  Thread 0x00007fbd57fff700 (most recent call first):
[ 2935s]   File "/home/abuild/rpmbuild/BUILD/Python-3.10.0/Lib/threading.py", line 320 in wait
[ 2935s]   File "/home/abuild/rpmbuild/BUILD/Python-3.10.0/Lib/multiprocessing/queues.py", line 233 in _feed
[ 2935s]   File "/home/abuild/rpmbuild/BUILD/Python-3.10.0/Lib/threading.py", line 946 in run
[ 2935s]   File "/home/abuild/rpmbuild/BUILD/Python-3.10.0/Lib/threading.py", line 1009 in _bootstrap_inner
[ 2935s]   File "/home/abuild/rpmbuild/BUILD/Python-3.10.0/Lib/threading.py", line 966 in _bootstrap
[ 2935s]
[ 2935s] Thread 0x00007fbd74ff9700 (most recent call first):
[ 2935s]   File "/home/abuild/rpmbuild/BUILD/Python-3.10.0/Lib/selectors.py", line 416 in select
[ 2935s]   File "/home/abuild/rpmbuild/BUILD/Python-3.10.0/Lib/multiprocessing/connection.py", line 936 in wait
[ 2935s]   File "/home/abuild/rpmbuild/BUILD/Python-3.10.0/Lib/concurrent/futures/process.py", line 377 in wait_result_broken_or_wakeup
[ 2935s]   File "/home/abuild/rpmbuild/BUILD/Python-3.10.0/Lib/concurrent/futures/process.py", line 317 in run
[ 2935s]   File "/home/abuild/rpmbuild/BUILD/Python-3.10.0/Lib/threading.py", line 1009 in _bootstrap_inner
[ 2935s]   File "/home/abuild/rpmbuild/BUILD/Python-3.10.0/Lib/threading.py", line 966 in _bootstrap
[ 2935s]
[ 2935s] Current thread 0x00007fbdae8ec740 (most recent call first):
[ 2935s]   File "/home/abuild/rpmbuild/BUILD/Python-3.10.0/Lib/test/test_concurrent_futures.py", line 1105 in _fail_on_deadlock
[ 2935s]   File "/home/abuild/rpmbuild/BUILD/Python-3.10.0/Lib/test/test_concurrent_futures.py", line 1137 in _check_crash
[ 2935s]   File "/home/abuild/rpmbuild/BUILD/Python-3.10.0/Lib/test/test_concurrent_futures.py", line 1172 in test_crash_during_result_pickle_on_worker
[ 2935s]   File "/home/abuild/rpmbuild/BUILD/Python-3.10.0/Lib/unittest/case.py", line 549 in _callTestMethod
[ 2935s]   File "/home/abuild/rpmbuild/BUILD/Python-3.10.0/Lib/unittest/case.py", line 591 in run
[ 2935s]   File "/home/abuild/rpmbuild/BUILD/Python-3.10.0/Lib/unittest/case.py", line 650 in __call__
[ 2935s]   File "/home/abuild/rpmbuild/BUILD/Python-3.10.0/Lib/unittest/suite.py", line 122 in run
[ 2935s]   File "/home/abuild/rpmbuild/BUILD/Python-3.10.0/Lib/unittest/suite.py", line 84 in __call__
[ 2935s]   File "/home/abuild/rpmbuild/BUILD/Python-3.10.0/Lib/unittest/suite.py", line 122 in run
[ 2935s]   File "/home/abuild/rpmbuild/BUILD/Python-3.10.0/Lib/unittest/suite.py", line 84 in __call__
[ 2935s]   File "/home/abuild/rpmbuild/BUILD/Python-3.10.0/Lib/unittest/suite.py", line 122 in run
[ 2935s]   File "/home/abuild/rpmbuild/BUILD/Python-3.10.0/Lib/unittest/suite.py", line 84 in __call__
[ 2935s]   File "/home/abuild/rpmbuild/BUILD/Python-3.10.0/Lib/unittest/runner.py", line 176 in run
[ 2935s]   File "/home/abuild/rpmbuild/BUILD/Python-3.10.0/Lib/test/support/__init__.py", line 990 in _run_suite
[ 2935s]   File "/home/abuild/rpmbuild/BUILD/Python-3.10.0/Lib/test/support/__init__.py", line 1115 in run_unittest
[ 2935s]   File "/home/abuild/rpmbuild/BUILD/Python-3.10.0/Lib/test/libregrtest/runtest.py", line 261 in _test_module
[ 2935s]   File "/home/abuild/rpmbuild/BUILD/Python-3.10.0/Lib/test/libregrtest/runtest.py", line 297 in _runtest_inner2
[ 2935s]   File "/home/abuild/rpmbuild/BUILD/Python-3.10.0/Lib/test/libregrtest/runtest.py", line 335 in _runtest_inner
[ 2935s]   File "/home/abuild/rpmbuild/BUILD/Python-3.10.0/Lib/test/libregrtest/runtest.py", line 215 in _runtest
[ 2935s]   File "/home/abuild/rpmbuild/BUILD/Python-3.10.0/Lib/test/libregrtest/runtest.py", line 245 in runtest
[ 2935s]   File "/home/abuild/rpmbuild/BUILD/Python-3.10.0/Lib/test/libregrtest/main.py", line 337 in rerun_failed_tests
[ 2935s]   File "/home/abuild/rpmbuild/BUILD/Python-3.10.0/Lib/test/libregrtest/main.py", line 715 in _main
[ 2935s]   File "/home/abuild/rpmbuild/BUILD/Python-3.10.0/Lib/test/libregrtest/main.py", line 658 in main
[ 2935s]   File "/home/abuild/rpmbuild/BUILD/Python-3.10.0/Lib/test/libregrtest/main.py", line 736 in main
[ 2935s]   File "/home/abuild/rpmbuild/BUILD/Python-3.10.0/Lib/test/regrtest.py", line 43 in _main
[ 2935s]   File "/home/abuild/rpmbuild/BUILD/Python-3.10.0/Lib/test/regrtest.py", line 47 in <module>
[ 2935s]   File "/home/abuild/rpmbuild/BUILD/Python-3.10.0/Lib/runpy.py", line 86 in _run_code
[ 2935s]   File "/home/abuild/rpmbuild/BUILD/Python-3.10.0/Lib/runpy.py", line 196 in _run_module_as_main
[ 2935s]
[ 2935s] 76.73s FAIL
[ 2935s]
[ 2935s] ======================================================================
[ 2935s] FAIL: test_crash_at_task_unpickle (test.test_concurrent_futures.ProcessPoolForkExecutorDeadlockTest)
[ 2935s] ----------------------------------------------------------------------
[ 2935s] Traceback (most recent call last):
[ 2935s]   File "/home/abuild/rpmbuild/BUILD/Python-3.10.0/Lib/test/test_concurrent_futures.py", line 1133, in _check_crash
[ 2935s]     res.result(timeout=self.TIMEOUT)
[ 2935s]   File "/home/abuild/rpmbuild/BUILD/Python-3.10.0/Lib/concurrent/futures/_base.py", line 447, in result
[ 2935s]     raise TimeoutError()
[ 2935s] concurrent.futures._base.TimeoutError
[ 2935s]
[ 2935s] During handling of the above exception, another exception occurred:
[ 2935s]
[ 2935s] Traceback (most recent call last):
[ 2935s]   File "/home/abuild/rpmbuild/BUILD/Python-3.10.0/Lib/test/test_concurrent_futures.py", line 1155, in test_crash_at_task_unpickle
[ 2935s]     self._check_crash(BrokenProcessPool, id, CrashAtUnpickle())
[ 2935s]   File "/home/abuild/rpmbuild/BUILD/Python-3.10.0/Lib/test/test_concurrent_futures.py", line 1137, in _check_crash
[ 2935s]     self._fail_on_deadlock(executor)
[ 2935s]   File "/home/abuild/rpmbuild/BUILD/Python-3.10.0/Lib/test/test_concurrent_futures.py", line 1114, in _fail_on_deadlock
[ 2935s]     self.fail(f"Executor deadlock:\n\n{tb}")
[ 2935s] AssertionError: Executor deadlock:
[ 2935s]
[ 2935s] Thread 0x00007fbd57fff700 (most recent call first):
[ 2935s]   File "/home/abuild/rpmbuild/BUILD/Python-3.10.0/Lib/threading.py", line 320 in wait
[ 2935s]   File "/home/abuild/rpmbuild/BUILD/Python-3.10.0/Lib/multiprocessing/queues.py", line 233 in _feed
[ 2935s]   File "/home/abuild/rpmbuild/BUILD/Python-3.10.0/Lib/threading.py", line 946 in run
[ 2935s]   File "/home/abuild/rpmbuild/BUILD/Python-3.10.0/Lib/threading.py", line 1009 in _bootstrap_inner
[ 2935s]   File "/home/abuild/rpmbuild/BUILD/Python-3.10.0/Lib/threading.py", line 966 in _bootstrap
[ 2935s]
[ 2935s] Thread 0x00007fbd74ff9700 (most recent call first):
[ 2935s]   File "/home/abuild/rpmbuild/BUILD/Python-3.10.0/Lib/selectors.py", line 416 in select
[ 2935s]   File "/home/abuild/rpmbuild/BUILD/Python-3.10.0/Lib/multiprocessing/connection.py", line 936 in wait
[ 2935s]   File "/home/abuild/rpmbuild/BUILD/Python-3.10.0/Lib/concurrent/futures/process.py", line 377 in wait_result_broken_or_wakeup
[ 2935s]   File "/home/abuild/rpmbuild/BUILD/Python-3.10.0/Lib/concurrent/futures/process.py", line 317 in run
[ 2935s]   File "/home/abuild/rpmbuild/BUILD/Python-3.10.0/Lib/threading.py", line 1009 in _bootstrap_inner
[ 2935s]   File "/home/abuild/rpmbuild/BUILD/Python-3.10.0/Lib/threading.py", line 966 in _bootstrap
[ 2935s]
[ 2935s] Current thread 0x00007fbdae8ec740 (most recent call first):
[ 2935s]   File "/home/abuild/rpmbuild/BUILD/Python-3.10.0/Lib/test/test_concurrent_futures.py", line 1105 in _fail_on_deadlock
[ 2935s]   File "/home/abuild/rpmbuild/BUILD/Python-3.10.0/Lib/test/test_concurrent_futures.py", line 1137 in _check_crash
[ 2935s]   File "/home/abuild/rpmbuild/BUILD/Python-3.10.0/Lib/test/test_concurrent_futures.py", line 1155 in test_crash_at_task_unpickle
[ 2935s]   File "/home/abuild/rpmbuild/BUILD/Python-3.10.0/Lib/unittest/case.py", line 549 in _callTestMethod
[ 2935s]   File "/home/abuild/rpmbuild/BUILD/Python-3.10.0/Lib/unittest/case.py", line 591 in run
[ 2935s]   File "/home/abuild/rpmbuild/BUILD/Python-3.10.0/Lib/unittest/case.py", line 650 in __call__
[ 2935s]   File "/home/abuild/rpmbuild/BUILD/Python-3.10.0/Lib/unittest/suite.py", line 122 in run
[ 2935s]   File "/home/abuild/rpmbuild/BUILD/Python-3.10.0/Lib/unittest/suite.py", line 84 in __call__
[ 2935s]   File "/home/abuild/rpmbuild/BUILD/Python-3.10.0/Lib/unittest/suite.py", line 122 in run
[ 2935s]   File "/home/abuild/rpmbuild/BUILD/Python-3.10.0/Lib/unittest/suite.py", line 84 in __call__
[ 2935s]   File "/home/abuild/rpmbuild/BUILD/Python-3.10.0/Lib/unittest/suite.py", line 122 in run
[ 2935s]   File "/home/abuild/rpmbuild/BUILD/Python-3.10.0/Lib/unittest/suite.py", line 84 in __call__
[ 2935s]   File "/home/abuild/rpmbuild/BUILD/Python-3.10.0/Lib/unittest/runner.py", line 176 in run
[ 2935s]   File "/home/abuild/rpmbuild/BUILD/Python-3.10.0/Lib/test/support/__init__.py", line 990 in _run_suite
[ 2935s]   File "/home/abuild/rpmbuild/BUILD/Python-3.10.0/Lib/test/support/__init__.py", line 1115 in run_unittest
[ 2935s]   File "/home/abuild/rpmbuild/BUILD/Python-3.10.0/Lib/test/libregrtest/runtest.py", line 261 in _test_module
[ 2935s]   File "/home/abuild/rpmbuild/BUILD/Python-3.10.0/Lib/test/libregrtest/runtest.py", line 297 in _runtest_inner2
[ 2935s]   File "/home/abuild/rpmbuild/BUILD/Python-3.10.0/Lib/test/libregrtest/runtest.py", line 335 in _runtest_inner
[ 2935s]   File "/home/abuild/rpmbuild/BUILD/Python-3.10.0/Lib/test/libregrtest/runtest.py", line 215 in _runtest
[ 2935s]   File "/home/abuild/rpmbuild/BUILD/Python-3.10.0/Lib/test/libregrtest/runtest.py", line 245 in runtest
[ 2935s]   File "/home/abuild/rpmbuild/BUILD/Python-3.10.0/Lib/test/libregrtest/main.py", line 337 in rerun_failed_tests
[ 2935s]   File "/home/abuild/rpmbuild/BUILD/Python-3.10.0/Lib/test/libregrtest/main.py", line 715 in _main
[ 2935s]   File "/home/abuild/rpmbuild/BUILD/Python-3.10.0/Lib/test/libregrtest/main.py", line 658 in main
[ 2935s]   File "/home/abuild/rpmbuild/BUILD/Python-3.10.0/Lib/test/libregrtest/main.py", line 736 in main
[ 2935s]   File "/home/abuild/rpmbuild/BUILD/Python-3.10.0/Lib/test/regrtest.py", line 43 in _main
[ 2935s]   File "/home/abuild/rpmbuild/BUILD/Python-3.10.0/Lib/test/regrtest.py", line 47 in <module>
[ 2935s]   File "/home/abuild/rpmbuild/BUILD/Python-3.10.0/Lib/runpy.py", line 86 in _run_code
[ 2935s]   File "/home/abuild/rpmbuild/BUILD/Python-3.10.0/Lib/runpy.py", line 196 in _run_module_as_main
[ 2935s]
[ 2935s]
[ 2935s] ======================================================================
[ 2935s] FAIL: test_crash_during_func_exec_on_worker (test.test_concurrent_futures.ProcessPoolForkExecutorDeadlockTest)
[ 2935s] ----------------------------------------------------------------------
[ 2935s] Traceback (most recent call last):
[ 2935s]   File "/home/abuild/rpmbuild/BUILD/Python-3.10.0/Lib/test/test_concurrent_futures.py", line 1133, in _check_crash
[ 2935s]     res.result(timeout=self.TIMEOUT)
[ 2935s]   File "/home/abuild/rpmbuild/BUILD/Python-3.10.0/Lib/concurrent/futures/_base.py", line 447, in result
[ 2935s]     raise TimeoutError()
[ 2935s] concurrent.futures._base.TimeoutError
[ 2935s]
[ 2935s] During handling of the above exception, another exception occurred:
[ 2935s]
[ 2935s] Traceback (most recent call last):
[ 2935s]   File "/home/abuild/rpmbuild/BUILD/Python-3.10.0/Lib/test/test_concurrent_futures.py", line 1159, in test_crash_during_func_exec_on_worker
[ 2935s]     self._check_crash(BrokenProcessPool, _crash)
[ 2935s]   File "/home/abuild/rpmbuild/BUILD/Python-3.10.0/Lib/test/test_concurrent_futures.py", line 1137, in _check_crash
[ 2935s]     self._fail_on_deadlock(executor)
[ 2935s]   File "/home/abuild/rpmbuild/BUILD/Python-3.10.0/Lib/test/test_concurrent_futures.py", line 1114, in _fail_on_deadlock
[ 2935s]     self.fail(f"Executor deadlock:\n\n{tb}")
[ 2935s] AssertionError: Executor deadlock:
[ 2935s]
[ 2935s] Thread 0x00007fbd57fff700 (most recent call first):
[ 2935s]   File "/home/abuild/rpmbuild/BUILD/Python-3.10.0/Lib/threading.py", line 320 in wait
[ 2935s]   File "/home/abuild/rpmbuild/BUILD/Python-3.10.0/Lib/multiprocessing/queues.py", line 233 in _feed
[ 2935s]   File "/home/abuild/rpmbuild/BUILD/Python-3.10.0/Lib/threading.py", line 946 in run
[ 2935s]   File "/home/abuild/rpmbuild/BUILD/Python-3.10.0/Lib/threading.py", line 1009 in _bootstrap_inner
[ 2935s]   File "/home/abuild/rpmbuild/BUILD/Python-3.10.0/Lib/threading.py", line 966 in _bootstrap
[ 2935s]
[ 2935s] Thread 0x00007fbd74ff9700 (most recent call first):
[ 2935s]   File "/home/abuild/rpmbuild/BUILD/Python-3.10.0/Lib/selectors.py", line 416 in select
[ 2935s]   File "/home/abuild/rpmbuild/BUILD/Python-3.10.0/Lib/multiprocessing/connection.py", line 936 in wait
[ 2935s]   File "/home/abuild/rpmbuild/BUILD/Python-3.10.0/Lib/concurrent/futures/process.py", line 377 in wait_result_broken_or_wakeup
[ 2935s]   File "/home/abuild/rpmbuild/BUILD/Python-3.10.0/Lib/concurrent/futures/process.py", line 317 in run
[ 2935s]   File "/home/abuild/rpmbuild/BUILD/Python-3.10.0/Lib/threading.py", line 1009 in _bootstrap_inner
[ 2935s]   File "/home/abuild/rpmbuild/BUILD/Python-3.10.0/Lib/threading.py", line 966 in _bootstrap
[ 2935s]
[ 2935s] Current thread 0x00007fbdae8ec740 (most recent call first):
[ 2935s]   File "/home/abuild/rpmbuild/BUILD/Python-3.10.0/Lib/test/test_concurrent_futures.py", line 1105 in _fail_on_deadlock
[ 2935s]   File "/home/abuild/rpmbuild/BUILD/Python-3.10.0/Lib/test/test_concurrent_futures.py", line 1137 in _check_crash
[ 2935s]   File "/home/abuild/rpmbuild/BUILD/Python-3.10.0/Lib/test/test_concurrent_futures.py", line 1159 in test_crash_during_func_exec_on_worker
[ 2935s]   File "/home/abuild/rpmbuild/BUILD/Python-3.10.0/Lib/unittest/case.py", line 549 in _callTestMethod
[ 2935s]   File "/home/abuild/rpmbuild/BUILD/Python-3.10.0/Lib/unittest/case.py", line 591 in run
[ 2935s]   File "/home/abuild/rpmbuild/BUILD/Python-3.10.0/Lib/unittest/case.py", line 650 in __call__
[ 2935s]   File "/home/abuild/rpmbuild/BUILD/Python-3.10.0/Lib/unittest/suite.py", line 122 in run
[ 2935s]   File "/home/abuild/rpmbuild/BUILD/Python-3.10.0/Lib/unittest/suite.py", line 84 in __call__
[ 2935s]   File "/home/abuild/rpmbuild/BUILD/Python-3.10.0/Lib/unittest/suite.py", line 122 in run
[ 2935s]   File "/home/abuild/rpmbuild/BUILD/Python-3.10.0/Lib/unittest/suite.py", line 84 in __call__
[ 2935s]   File "/home/abuild/rpmbuild/BUILD/Python-3.10.0/Lib/unittest/suite.py", line 122 in run
[ 2935s]   File "/home/abuild/rpmbuild/BUILD/Python-3.10.0/Lib/unittest/suite.py", line 84 in __call__
[ 2935s]   File "/home/abuild/rpmbuild/BUILD/Python-3.10.0/Lib/unittest/runner.py", line 176 in run
[ 2935s]   File "/home/abuild/rpmbuild/BUILD/Python-3.10.0/Lib/test/support/__init__.py", line 990 in _run_suite
[ 2935s]   File "/home/abuild/rpmbuild/BUILD/Python-3.10.0/Lib/test/support/__init__.py", line 1115 in run_unittest
[ 2935s]   File "/home/abuild/rpmbuild/BUILD/Python-3.10.0/Lib/test/libregrtest/runtest.py", line 261 in _test_module
[ 2935s]   File "/home/abuild/rpmbuild/BUILD/Python-3.10.0/Lib/test/libregrtest/runtest.py", line 297 in _runtest_inner2
[ 2935s]   File "/home/abuild/rpmbuild/BUILD/Python-3.10.0/Lib/test/libregrtest/runtest.py", line 335 in _runtest_inner
[ 2935s]   File "/home/abuild/rpmbuild/BUILD/Python-3.10.0/Lib/test/libregrtest/runtest.py", line 215 in _runtest
[ 2935s]   File "/home/abuild/rpmbuild/BUILD/Python-3.10.0/Lib/test/libregrtest/runtest.py", line 245 in runtest
[ 2935s]   File "/home/abuild/rpmbuild/BUILD/Python-3.10.0/Lib/test/libregrtest/main.py", line 337 in rerun_failed_tests
[ 2935s]   File "/home/abuild/rpmbuild/BUILD/Python-3.10.0/Lib/test/libregrtest/main.py", line 715 in _main
[ 2935s]   File "/home/abuild/rpmbuild/BUILD/Python-3.10.0/Lib/test/libregrtest/main.py", line 658 in main
[ 2935s]   File "/home/abuild/rpmbuild/BUILD/Python-3.10.0/Lib/test/libregrtest/main.py", line 736 in main
[ 2935s]   File "/home/abuild/rpmbuild/BUILD/Python-3.10.0/Lib/test/regrtest.py", line 43 in _main
[ 2935s]   File "/home/abuild/rpmbuild/BUILD/Python-3.10.0/Lib/test/regrtest.py", line 47 in <module>
[ 2935s]   File "/home/abuild/rpmbuild/BUILD/Python-3.10.0/Lib/runpy.py", line 86 in _run_code
[ 2935s]   File "/home/abuild/rpmbuild/BUILD/Python-3.10.0/Lib/runpy.py", line 196 in _run_module_as_main
[ 2935s]
[ 2935s]
[ 2935s] ======================================================================
[ 2935s] FAIL: test_crash_during_result_pickle_on_worker (test.test_concurrent_futures.ProcessPoolForkExecutorDeadlockTest)
[ 2935s] ----------------------------------------------------------------------
[ 2935s] Traceback (most recent call last):
[ 2935s]   File "/home/abuild/rpmbuild/BUILD/Python-3.10.0/Lib/test/test_concurrent_futures.py", line 1133, in _check_crash
[ 2935s]     res.result(timeout=self.TIMEOUT)
[ 2935s]   File "/home/abuild/rpmbuild/BUILD/Python-3.10.0/Lib/concurrent/futures/_base.py", line 447, in result
[ 2935s]     raise TimeoutError()
[ 2935s] concurrent.futures._base.TimeoutError
[ 2935s]
[ 2935s] During handling of the above exception, another exception occurred:
[ 2935s]
[ 2935s] Traceback (most recent call last):
[ 2935s]   File "/home/abuild/rpmbuild/BUILD/Python-3.10.0/Lib/test/test_concurrent_futures.py", line 1172, in test_crash_during_result_pickle_on_worker
[ 2935s]     self._check_crash(BrokenProcessPool, _return_instance, CrashAtPickle)
[ 2935s]   File "/home/abuild/rpmbuild/BUILD/Python-3.10.0/Lib/test/test_concurrent_futures.py", line 1137, in _check_crash
[ 2935s]     self._fail_on_deadlock(executor)
[ 2935s]   File "/home/abuild/rpmbuild/BUILD/Python-3.10.0/Lib/test/test_concurrent_futures.py", line 1114, in _fail_on_deadlock
[ 2935s]     self.fail(f"Executor deadlock:\n\n{tb}")
[ 2935s] AssertionError: Executor deadlock:
[ 2935s]
[ 2935s] Thread 0x00007fbd57fff700 (most recent call first):
[ 2935s]   File "/home/abuild/rpmbuild/BUILD/Python-3.10.0/Lib/threading.py", line 320 in wait
[ 2935s]   File "/home/abuild/rpmbuild/BUILD/Python-3.10.0/Lib/multiprocessing/queues.py", line 233 in _feed
[ 2935s]   File "/home/abuild/rpmbuild/BUILD/Python-3.10.0/Lib/threading.py", line 946 in run
[ 2935s]   File "/home/abuild/rpmbuild/BUILD/Python-3.10.0/Lib/threading.py", line 1009 in _bootstrap_inner
[ 2935s]   File "/home/abuild/rpmbuild/BUILD/Python-3.10.0/Lib/threading.py", line 966 in _bootstrap
[ 2935s]
[ 2935s] Thread 0x00007fbd74ff9700 (most recent call first):
[ 2935s]   File "/home/abuild/rpmbuild/BUILD/Python-3.10.0/Lib/selectors.py", line 416 in select
[ 2935s]   File "/home/abuild/rpmbuild/BUILD/Python-3.10.0/Lib/multiprocessing/connection.py", line 936 in wait
[ 2935s]   File "/home/abuild/rpmbuild/BUILD/Python-3.10.0/Lib/concurrent/futures/process.py", line 377 in wait_result_broken_or_wakeup
[ 2935s]   File "/home/abuild/rpmbuild/BUILD/Python-3.10.0/Lib/concurrent/futures/process.py", line 317 in run
[ 2935s]   File "/home/abuild/rpmbuild/BUILD/Python-3.10.0/Lib/threading.py", line 1009 in _bootstrap_inner
[ 2935s]   File "/home/abuild/rpmbuild/BUILD/Python-3.10.0/Lib/threading.py", line 966 in _bootstrap
[ 2935s]
[ 2935s] Current thread 0x00007fbdae8ec740 (most recent call first):
[ 2935s]   File "/home/abuild/rpmbuild/BUILD/Python-3.10.0/Lib/test/test_concurrent_futures.py", line 1105 in _fail_on_deadlock
[ 2935s]   File "/home/abuild/rpmbuild/BUILD/Python-3.10.0/Lib/test/test_concurrent_futures.py", line 1137 in _check_crash
[ 2935s]   File "/home/abuild/rpmbuild/BUILD/Python-3.10.0/Lib/test/test_concurrent_futures.py", line 1172 in test_crash_during_result_pickle_on_worker
[ 2935s]   File "/home/abuild/rpmbuild/BUILD/Python-3.10.0/Lib/unittest/case.py", line 549 in _callTestMethod
[ 2935s]   File "/home/abuild/rpmbuild/BUILD/Python-3.10.0/Lib/unittest/case.py", line 591 in run
[ 2935s]   File "/home/abuild/rpmbuild/BUILD/Python-3.10.0/Lib/unittest/case.py", line 650 in __call__
[ 2935s]   File "/home/abuild/rpmbuild/BUILD/Python-3.10.0/Lib/unittest/suite.py", line 122 in run
[ 2935s]   File "/home/abuild/rpmbuild/BUILD/Python-3.10.0/Lib/unittest/suite.py", line 84 in __call__
[ 2935s]   File "/home/abuild/rpmbuild/BUILD/Python-3.10.0/Lib/unittest/suite.py", line 122 in run
[ 2935s]   File "/home/abuild/rpmbuild/BUILD/Python-3.10.0/Lib/unittest/suite.py", line 84 in __call__
[ 2935s]   File "/home/abuild/rpmbuild/BUILD/Python-3.10.0/Lib/unittest/suite.py", line 122 in run
[ 2935s]   File "/home/abuild/rpmbuild/BUILD/Python-3.10.0/Lib/unittest/suite.py", line 84 in __call__
[ 2935s]   File "/home/abuild/rpmbuild/BUILD/Python-3.10.0/Lib/unittest/runner.py", line 176 in run
[ 2935s]   File "/home/abuild/rpmbuild/BUILD/Python-3.10.0/Lib/test/support/__init__.py", line 990 in _run_suite
[ 2935s]   File "/home/abuild/rpmbuild/BUILD/Python-3.10.0/Lib/test/support/__init__.py", line 1115 in run_unittest
[ 2935s]   File "/home/abuild/rpmbuild/BUILD/Python-3.10.0/Lib/test/libregrtest/runtest.py", line 261 in _test_module
[ 2935s]   File "/home/abuild/rpmbuild/BUILD/Python-3.10.0/Lib/test/libregrtest/runtest.py", line 297 in _runtest_inner2
[ 2935s]   File "/home/abuild/rpmbuild/BUILD/Python-3.10.0/Lib/test/libregrtest/runtest.py", line 335 in _runtest_inner
[ 2935s]   File "/home/abuild/rpmbuild/BUILD/Python-3.10.0/Lib/test/libregrtest/runtest.py", line 215 in _runtest
[ 2935s]   File "/home/abuild/rpmbuild/BUILD/Python-3.10.0/Lib/test/libregrtest/runtest.py", line 245 in runtest
[ 2935s]   File "/home/abuild/rpmbuild/BUILD/Python-3.10.0/Lib/test/libregrtest/main.py", line 337 in rerun_failed_tests
[ 2935s]   File "/home/abuild/rpmbuild/BUILD/Python-3.10.0/Lib/test/libregrtest/main.py", line 715 in _main
[ 2935s]   File "/home/abuild/rpmbuild/BUILD/Python-3.10.0/Lib/test/libregrtest/main.py", line 658 in main
[ 2935s]   File "/home/abuild/rpmbuild/BUILD/Python-3.10.0/Lib/test/libregrtest/main.py", line 736 in main
[ 2935s]   File "/home/abuild/rpmbuild/BUILD/Python-3.10.0/Lib/test/regrtest.py", line 43 in _main
[ 2935s]   File "/home/abuild/rpmbuild/BUILD/Python-3.10.0/Lib/test/regrtest.py", line 47 in <module>
[ 2935s]   File "/home/abuild/rpmbuild/BUILD/Python-3.10.0/Lib/runpy.py", line 86 in _run_code
[ 2935s]   File "/home/abuild/rpmbuild/BUILD/Python-3.10.0/Lib/runpy.py", line 196 in _run_module_as_main
[ 2935s]
[ 2935s]
[ 2935s] ======================================================================
[ 2935s] FAIL: test_crash_at_task_unpickle (test.test_concurrent_futures.ProcessPoolForkserverExecutorDeadlockTest)
[ 2935s] ----------------------------------------------------------------------
[ 2935s] Traceback (most recent call last):
[ 2935s]   File "/home/abuild/rpmbuild/BUILD/Python-3.10.0/Lib/test/test_concurrent_futures.py", line 1133, in _check_crash
[ 2935s]     res.result(timeout=self.TIMEOUT)
[ 2935s]   File "/home/abuild/rpmbuild/BUILD/Python-3.10.0/Lib/concurrent/futures/_base.py", line 447, in result
[ 2935s]     raise TimeoutError()
[ 2935s] concurrent.futures._base.TimeoutError
[ 2935s]
[ 2935s] During handling of the above exception, another exception occurred:
[ 2935s]
[ 2935s] Traceback (most recent call last):
[ 2935s]   File "/home/abuild/rpmbuild/BUILD/Python-3.10.0/Lib/test/test_concurrent_futures.py", line 1155, in test_crash_at_task_unpickle
[ 2935s]     self._check_crash(BrokenProcessPool, id, CrashAtUnpickle())
[ 2935s]   File "/home/abuild/rpmbuild/BUILD/Python-3.10.0/Lib/test/test_concurrent_futures.py", line 1137, in _check_crash
[ 2935s]     self._fail_on_deadlock(executor)
[ 2935s]   File "/home/abuild/rpmbuild/BUILD/Python-3.10.0/Lib/test/test_concurrent_futures.py", line 1114, in _fail_on_deadlock
[ 2935s]     self.fail(f"Executor deadlock:\n\n{tb}")
[ 2935s] AssertionError: Executor deadlock:
[ 2935s]
[ 2935s] Thread 0x00007fbd57fff700 (most recent call first):
[ 2935s]   File "/home/abuild/rpmbuild/BUILD/Python-3.10.0/Lib/threading.py", line 320 in wait
[ 2935s]   File "/home/abuild/rpmbuild/BUILD/Python-3.10.0/Lib/multiprocessing/queues.py", line 233 in _feed
[ 2935s]   File "/home/abuild/rpmbuild/BUILD/Python-3.10.0/Lib/threading.py", line 946 in run
[ 2935s]   File "/home/abuild/rpmbuild/BUILD/Python-3.10.0/Lib/threading.py", line 1009 in _bootstrap_inner
[ 2935s]   File "/home/abuild/rpmbuild/BUILD/Python-3.10.0/Lib/threading.py", line 966 in _bootstrap
[ 2935s]
[ 2935s] Thread 0x00007fbd74ff9700 (most recent call first):
[ 2935s]   File "/home/abuild/rpmbuild/BUILD/Python-3.10.0/Lib/selectors.py", line 416 in select
[ 2935s]   File "/home/abuild/rpmbuild/BUILD/Python-3.10.0/Lib/multiprocessing/connection.py", line 936 in wait
[ 2935s]   File "/home/abuild/rpmbuild/BUILD/Python-3.10.0/Lib/concurrent/futures/process.py", line 377 in wait_result_broken_or_wakeup
[ 2935s]   File "/home/abuild/rpmbuild/BUILD/Python-3.10.0/Lib/concurrent/futures/process.py", line 317 in run
[ 2935s]   File "/home/abuild/rpmbuild/BUILD/Python-3.10.0/Lib/threading.py", line 1009 in _bootstrap_inner
[ 2935s]   File "/home/abuild/rpmbuild/BUILD/Python-3.10.0/Lib/threading.py", line 966 in _bootstrap
[ 2935s]
[ 2935s] Current thread 0x00007fbdae8ec740 (most recent call first):
[ 2935s]   File "/home/abuild/rpmbuild/BUILD/Python-3.10.0/Lib/test/test_concurrent_futures.py", line 1105 in _fail_on_deadlock
[ 2935s]   File "/home/abuild/rpmbuild/BUILD/Python-3.10.0/Lib/test/test_concurrent_futures.py", line 1137 in _check_crash
[ 2935s]   File "/home/abuild/rpmbuild/BUILD/Python-3.10.0/Lib/test/test_concurrent_futures.py", line 1155 in test_crash_at_task_unpickle
[ 2935s]   File "/home/abuild/rpmbuild/BUILD/Python-3.10.0/Lib/unittest/case.py", line 549 in _callTestMethod
[ 2935s]   File "/home/abuild/rpmbuild/BUILD/Python-3.10.0/Lib/unittest/case.py", line 591 in run
[ 2935s]   File "/home/abuild/rpmbuild/BUILD/Python-3.10.0/Lib/unittest/case.py", line 650 in __call__
[ 2935s]   File "/home/abuild/rpmbuild/BUILD/Python-3.10.0/Lib/unittest/suite.py", line 122 in run
[ 2935s]   File "/home/abuild/rpmbuild/BUILD/Python-3.10.0/Lib/unittest/suite.py", line 84 in __call__
[ 2935s]   File "/home/abuild/rpmbuild/BUILD/Python-3.10.0/Lib/unittest/suite.py", line 122 in run
[ 2935s]   File "/home/abuild/rpmbuild/BUILD/Python-3.10.0/Lib/unittest/suite.py", line 84 in __call__
[ 2935s]   File "/home/abuild/rpmbuild/BUILD/Python-3.10.0/Lib/unittest/suite.py", line 122 in run
[ 2935s]   File "/home/abuild/rpmbuild/BUILD/Python-3.10.0/Lib/unittest/suite.py", line 84 in __call__
[ 2935s]   File "/home/abuild/rpmbuild/BUILD/Python-3.10.0/Lib/unittest/runner.py", line 176 in run
[ 2935s]   File "/home/abuild/rpmbuild/BUILD/Python-3.10.0/Lib/test/support/__init__.py", line 990 in _run_suite
[ 2935s]   File "/home/abuild/rpmbuild/BUILD/Python-3.10.0/Lib/test/support/__init__.py", line 1115 in run_unittest
[ 2935s]   File "/home/abuild/rpmbuild/BUILD/Python-3.10.0/Lib/test/libregrtest/runtest.py", line 261 in _test_module
[ 2935s]   File "/home/abuild/rpmbuild/BUILD/Python-3.10.0/Lib/test/libregrtest/runtest.py", line 297 in _runtest_inner2
[ 2935s]   File "/home/abuild/rpmbuild/BUILD/Python-3.10.0/Lib/test/libregrtest/runtest.py", line 335 in _runtest_inner
[ 2935s]   File "/home/abuild/rpmbuild/BUILD/Python-3.10.0/Lib/test/libregrtest/runtest.py", line 215 in _runtest
[ 2935s]   File "/home/abuild/rpmbuild/BUILD/Python-3.10.0/Lib/test/libregrtest/runtest.py", line 245 in runtest
[ 2935s]   File "/home/abuild/rpmbuild/BUILD/Python-3.10.0/Lib/test/libregrtest/main.py", line 337 in rerun_failed_tests
[ 2935s]   File "/home/abuild/rpmbuild/BUILD/Python-3.10.0/Lib/test/libregrtest/main.py", line 715 in _main
[ 2935s]   File "/home/abuild/rpmbuild/BUILD/Python-3.10.0/Lib/test/libregrtest/main.py", line 658 in main
[ 2935s]   File "/home/abuild/rpmbuild/BUILD/Python-3.10.0/Lib/test/libregrtest/main.py", line 736 in main
[ 2935s]   File "/home/abuild/rpmbuild/BUILD/Python-3.10.0/Lib/test/regrtest.py", line 43 in _main
[ 2935s]   File "/home/abuild/rpmbuild/BUILD/Python-3.10.0/Lib/test/regrtest.py", line 47 in <module>
[ 2935s]   File "/home/abuild/rpmbuild/BUILD/Python-3.10.0/Lib/runpy.py", line 86 in _run_code
[ 2935s]   File "/home/abuild/rpmbuild/BUILD/Python-3.10.0/Lib/runpy.py", line 196 in _run_module_as_main
[ 2935s]
[ 2935s]
[ 2935s] ======================================================================
[ 2935s] FAIL: test_crash_during_func_exec_on_worker (test.test_concurrent_futures.ProcessPoolForkserverExecutorDeadlockTest)
[ 2935s] ----------------------------------------------------------------------
[ 2935s] Traceback (most recent call last):
[ 2935s]   File "/home/abuild/rpmbuild/BUILD/Python-3.10.0/Lib/test/test_concurrent_futures.py", line 1133, in _check_crash
[ 2935s]     res.result(timeout=self.TIMEOUT)
[ 2935s]   File "/home/abuild/rpmbuild/BUILD/Python-3.10.0/Lib/concurrent/futures/_base.py", line 447, in result
[ 2935s]     raise TimeoutError()
[ 2935s] concurrent.futures._base.TimeoutError
[ 2935s]
[ 2935s] During handling of the above exception, another exception occurred:
[ 2935s]
[ 2935s] Traceback (most recent call last):
[ 2935s]   File "/home/abuild/rpmbuild/BUILD/Python-3.10.0/Lib/test/test_concurrent_futures.py", line 1159, in test_crash_during_func_exec_on_worker
[ 2935s]     self._check_crash(BrokenProcessPool, _crash)
[ 2935s]   File "/home/abuild/rpmbuild/BUILD/Python-3.10.0/Lib/test/test_concurrent_futures.py", line 1137, in _check_crash
[ 2935s]     self._fail_on_deadlock(executor)
[ 2935s]   File "/home/abuild/rpmbuild/BUILD/Python-3.10.0/Lib/test/test_concurrent_futures.py", line 1114, in _fail_on_deadlock
[ 2935s]     self.fail(f"Executor deadlock:\n\n{tb}")
[ 2935s] AssertionError: Executor deadlock:
[ 2935s]
[ 2935s] Thread 0x00007fbd57fff700 (most recent call first):
[ 2935s]   File "/home/abuild/rpmbuild/BUILD/Python-3.10.0/Lib/threading.py", line 320 in wait
[ 2935s]   File "/home/abuild/rpmbuild/BUILD/Python-3.10.0/Lib/multiprocessing/queues.py", line 233 in _feed
[ 2935s]   File "/home/abuild/rpmbuild/BUILD/Python-3.10.0/Lib/threading.py", line 946 in run
[ 2935s]   File "/home/abuild/rpmbuild/BUILD/Python-3.10.0/Lib/threading.py", line 1009 in _bootstrap_inner
[ 2935s]   File "/home/abuild/rpmbuild/BUILD/Python-3.10.0/Lib/threading.py", line 966 in _bootstrap
[ 2935s]
[ 2935s] Thread 0x00007fbd74ff9700 (most recent call first):
[ 2935s]   File "/home/abuild/rpmbuild/BUILD/Python-3.10.0/Lib/selectors.py", line 416 in select
[ 2935s]   File "/home/abuild/rpmbuild/BUILD/Python-3.10.0/Lib/multiprocessing/connection.py", line 936 in wait
[ 2935s]   File "/home/abuild/rpmbuild/BUILD/Python-3.10.0/Lib/concurrent/futures/process.py", line 377 in wait_result_broken_or_wakeup
[ 2935s]   File "/home/abuild/rpmbuild/BUILD/Python-3.10.0/Lib/concurrent/futures/process.py", line 317 in run
[ 2935s]   File "/home/abuild/rpmbuild/BUILD/Python-3.10.0/Lib/threading.py", line 1009 in _bootstrap_inner
[ 2935s]   File "/home/abuild/rpmbuild/BUILD/Python-3.10.0/Lib/threading.py", line 966 in _bootstrap
[ 2935s]
[ 2935s] Current thread 0x00007fbdae8ec740 (most recent call first):
[ 2935s]   File "/home/abuild/rpmbuild/BUILD/Python-3.10.0/Lib/test/test_concurrent_futures.py", line 1105 in _fail_on_deadlock
[ 2935s]   File "/home/abuild/rpmbuild/BUILD/Python-3.10.0/Lib/test/test_concurrent_futures.py", line 1137 in _check_crash
[ 2935s]   File "/home/abuild/rpmbuild/BUILD/Python-3.10.0/Lib/test/test_concurrent_futures.py", line 1159 in test_crash_during_func_exec_on_worker
[ 2935s]   File "/home/abuild/rpmbuild/BUILD/Python-3.10.0/Lib/unittest/case.py", line 549 in _callTestMethod
[ 2935s]   File "/home/abuild/rpmbuild/BUILD/Python-3.10.0/Lib/unittest/case.py", line 591 in run
[ 2935s]   File "/home/abuild/rpmbuild/BUILD/Python-3.10.0/Lib/unittest/case.py", line 650 in __call__
[ 2935s]   File "/home/abuild/rpmbuild/BUILD/Python-3.10.0/Lib/unittest/suite.py", line 122 in run
[ 2935s]   File "/home/abuild/rpmbuild/BUILD/Python-3.10.0/Lib/unittest/suite.py", line 84 in __call__
[ 2935s]   File "/home/abuild/rpmbuild/BUILD/Python-3.10.0/Lib/unittest/suite.py", line 122 in run
[ 2935s]   File "/home/abuild/rpmbuild/BUILD/Python-3.10.0/Lib/unittest/suite.py", line 84 in __call__
[ 2935s]   File "/home/abuild/rpmbuild/BUILD/Python-3.10.0/Lib/unittest/suite.py", line 122 in run
[ 2935s]   File "/home/abuild/rpmbuild/BUILD/Python-3.10.0/Lib/unittest/suite.py", line 84 in __call__
[ 2935s]   File "/home/abuild/rpmbuild/BUILD/Python-3.10.0/Lib/unittest/runner.py", line 176 in run
[ 2935s]   File "/home/abuild/rpmbuild/BUILD/Python-3.10.0/Lib/test/support/__init__.py", line 990 in _run_suite
[ 2935s]   File "/home/abuild/rpmbuild/BUILD/Python-3.10.0/Lib/test/support/__init__.py", line 1115 in run_unittest
[ 2935s]   File "/home/abuild/rpmbuild/BUILD/Python-3.10.0/Lib/test/libregrtest/runtest.py", line 261 in _test_module
[ 2935s]   File "/home/abuild/rpmbuild/BUILD/Python-3.10.0/Lib/test/libregrtest/runtest.py", line 297 in _runtest_inner2
[ 2935s]   File "/home/abuild/rpmbuild/BUILD/Python-3.10.0/Lib/test/libregrtest/runtest.py", line 335 in _runtest_inner
[ 2935s]   File "/home/abuild/rpmbuild/BUILD/Python-3.10.0/Lib/test/libregrtest/runtest.py", line 215 in _runtest
[ 2935s]   File "/home/abuild/rpmbuild/BUILD/Python-3.10.0/Lib/test/libregrtest/runtest.py", line 245 in runtest
[ 2935s]   File "/home/abuild/rpmbuild/BUILD/Python-3.10.0/Lib/test/libregrtest/main.py", line 337 in rerun_failed_tests
[ 2935s]   File "/home/abuild/rpmbuild/BUILD/Python-3.10.0/Lib/test/libregrtest/main.py", line 715 in _main
[ 2935s]   File "/home/abuild/rpmbuild/BUILD/Python-3.10.0/Lib/test/libregrtest/main.py", line 658 in main
[ 2935s]   File "/home/abuild/rpmbuild/BUILD/Python-3.10.0/Lib/test/libregrtest/main.py", line 736 in main
[ 2935s]   File "/home/abuild/rpmbuild/BUILD/Python-3.10.0/Lib/test/regrtest.py", line 43 in _main
[ 2935s]   File "/home/abuild/rpmbuild/BUILD/Python-3.10.0/Lib/test/regrtest.py", line 47 in <module>
[ 2935s]   File "/home/abuild/rpmbuild/BUILD/Python-3.10.0/Lib/runpy.py", line 86 in _run_code
[ 2935s]   File "/home/abuild/rpmbuild/BUILD/Python-3.10.0/Lib/runpy.py", line 196 in _run_module_as_main
[ 2935s]
[ 2935s]
[ 2935s] ======================================================================
[ 2935s] FAIL: test_crash_during_result_pickle_on_worker (test.test_concurrent_futures.ProcessPoolForkserverExecutorDeadlockTest)
[ 2935s] ----------------------------------------------------------------------
[ 2935s] Traceback (most recent call last):
[ 2935s]   File "/home/abuild/rpmbuild/BUILD/Python-3.10.0/Lib/test/test_concurrent_futures.py", line 1133, in _check_crash
[ 2935s]     res.result(timeout=self.TIMEOUT)
[ 2935s]   File "/home/abuild/rpmbuild/BUILD/Python-3.10.0/Lib/concurrent/futures/_base.py", line 447, in result
[ 2935s]     raise TimeoutError()
[ 2935s] concurrent.futures._base.TimeoutError
[ 2935s]
[ 2935s] During handling of the above exception, another exception occurred:
[ 2935s]
[ 2935s] Traceback (most recent call last):
[ 2935s]   File "/home/abuild/rpmbuild/BUILD/Python-3.10.0/Lib/test/test_concurrent_futures.py", line 1172, in test_crash_during_result_pickle_on_worker
[ 2935s]     self._check_crash(BrokenProcessPool, _return_instance, CrashAtPickle)
[ 2935s]   File "/home/abuild/rpmbuild/BUILD/Python-3.10.0/Lib/test/test_concurrent_futures.py", line 1137, in _check_crash
[ 2935s]     self._fail_on_deadlock(executor)
[ 2935s]   File "/home/abuild/rpmbuild/BUILD/Python-3.10.0/Lib/test/test_concurrent_futures.py", line 1114, in _fail_on_deadlock
[ 2935s]     self.fail(f"Executor deadlock:\n\n{tb}")
[ 2935s] AssertionError: Executor deadlock:
[ 2935s]
[ 2935s] Thread 0x00007fbd57fff700 (most recent call first):
[ 2935s]   File "/home/abuild/rpmbuild/BUILD/Python-3.10.0/Lib/threading.py", line 320 in wait
[ 2935s]   File "/home/abuild/rpmbuild/BUILD/Python-3.10.0/Lib/multiprocessing/queues.py", line 233 in _feed
[ 2935s]   File "/home/abuild/rpmbuild/BUILD/Python-3.10.0/Lib/threading.py", line 946 in run
[ 2935s]   File "/home/abuild/rpmbuild/BUILD/Python-3.10.0/Lib/threading.py", line 1009 in _bootstrap_inner
[ 2935s]   File "/home/abuild/rpmbuild/BUILD/Python-3.10.0/Lib/threading.py", line 966 in _bootstrap
[ 2935s]
[ 2935s] Thread 0x00007fbd74ff9700 (most recent call first):
[ 2935s]   File "/home/abuild/rpmbuild/BUILD/Python-3.10.0/Lib/selectors.py", line 416 in select
[ 2935s]   File "/home/abuild/rpmbuild/BUILD/Python-3.10.0/Lib/multiprocessing/connection.py", line 936 in wait
[ 2935s]   File "/home/abuild/rpmbuild/BUILD/Python-3.10.0/Lib/concurrent/futures/process.py", line 377 in wait_result_broken_or_wakeup
[ 2935s]   File "/home/abuild/rpmbuild/BUILD/Python-3.10.0/Lib/concurrent/futures/process.py", line 317 in run
[ 2935s]   File "/home/abuild/rpmbuild/BUILD/Python-3.10.0/Lib/threading.py", line 1009 in _bootstrap_inner
[ 2935s]   File "/home/abuild/rpmbuild/BUILD/Python-3.10.0/Lib/threading.py", line 966 in _bootstrap
[ 2935s]
[ 2935s] Current thread 0x00007fbdae8ec740 (most recent call first):
[ 2935s]   File "/home/abuild/rpmbuild/BUILD/Python-3.10.0/Lib/test/test_concurrent_futures.py", line 1105 in _fail_on_deadlock
[ 2935s]   File "/home/abuild/rpmbuild/BUILD/Python-3.10.0/Lib/test/test_concurrent_futures.py", line 1137 in _check_crash
[ 2935s]   File "/home/abuild/rpmbuild/BUILD/Python-3.10.0/Lib/test/test_concurrent_futures.py", line 1172 in test_crash_during_result_pickle_on_worker
[ 2935s]   File "/home/abuild/rpmbuild/BUILD/Python-3.10.0/Lib/unittest/case.py", line 549 in _callTestMethod
[ 2935s]   File "/home/abuild/rpmbuild/BUILD/Python-3.10.0/Lib/unittest/case.py", line 591 in run
[ 2935s]   File "/home/abuild/rpmbuild/BUILD/Python-3.10.0/Lib/unittest/case.py", line 650 in __call__
[ 2935s]   File "/home/abuild/rpmbuild/BUILD/Python-3.10.0/Lib/unittest/suite.py", line 122 in run
[ 2935s]   File "/home/abuild/rpmbuild/BUILD/Python-3.10.0/Lib/unittest/suite.py", line 84 in __call__
[ 2935s]   File "/home/abuild/rpmbuild/BUILD/Python-3.10.0/Lib/unittest/suite.py", line 122 in run
[ 2935s]   File "/home/abuild/rpmbuild/BUILD/Python-3.10.0/Lib/unittest/suite.py", line 84 in __call__
[ 2935s]   File "/home/abuild/rpmbuild/BUILD/Python-3.10.0/Lib/unittest/suite.py", line 122 in run
[ 2935s]   File "/home/abuild/rpmbuild/BUILD/Python-3.10.0/Lib/unittest/suite.py", line 84 in __call__
[ 2935s]   File "/home/abuild/rpmbuild/BUILD/Python-3.10.0/Lib/unittest/runner.py", line 176 in run
[ 2935s]   File "/home/abuild/rpmbuild/BUILD/Python-3.10.0/Lib/test/support/__init__.py", line 990 in _run_suite
[ 2935s]   File "/home/abuild/rpmbuild/BUILD/Python-3.10.0/Lib/test/support/__init__.py", line 1115 in run_unittest
[ 2935s]   File "/home/abuild/rpmbuild/BUILD/Python-3.10.0/Lib/test/libregrtest/runtest.py", line 261 in _test_module
[ 2935s]   File "/home/abuild/rpmbuild/BUILD/Python-3.10.0/Lib/test/libregrtest/runtest.py", line 297 in _runtest_inner2
[ 2935s]   File "/home/abuild/rpmbuild/BUILD/Python-3.10.0/Lib/test/libregrtest/runtest.py", line 335 in _runtest_inner
[ 2935s]   File "/home/abuild/rpmbuild/BUILD/Python-3.10.0/Lib/test/libregrtest/runtest.py", line 215 in _runtest
[ 2935s]   File "/home/abuild/rpmbuild/BUILD/Python-3.10.0/Lib/test/libregrtest/runtest.py", line 245 in runtest
[ 2935s]   File "/home/abuild/rpmbuild/BUILD/Python-3.10.0/Lib/test/libregrtest/main.py", line 337 in rerun_failed_tests
[ 2935s]   File "/home/abuild/rpmbuild/BUILD/Python-3.10.0/Lib/test/libregrtest/main.py", line 715 in _main
[ 2935s]   File "/home/abuild/rpmbuild/BUILD/Python-3.10.0/Lib/test/libregrtest/main.py", line 658 in main
[ 2935s]   File "/home/abuild/rpmbuild/BUILD/Python-3.10.0/Lib/test/libregrtest/main.py", line 736 in main
[ 2935s]   File "/home/abuild/rpmbuild/BUILD/Python-3.10.0/Lib/test/regrtest.py", line 43 in _main
[ 2935s]   File "/home/abuild/rpmbuild/BUILD/Python-3.10.0/Lib/test/regrtest.py", line 47 in <module>
[ 2935s]   File "/home/abuild/rpmbuild/BUILD/Python-3.10.0/Lib/runpy.py", line 86 in _run_code
[ 2935s]   File "/home/abuild/rpmbuild/BUILD/Python-3.10.0/Lib/runpy.py", line 196 in _run_module_as_main
[ 2935s]
[ 2935s]
[ 2935s] ======================================================================
[ 2935s] FAIL: test_crash_at_task_unpickle (test.test_concurrent_futures.ProcessPoolSpawnExecutorDeadlockTest)
[ 2935s] ----------------------------------------------------------------------
[ 2935s] Traceback (most recent call last):
[ 2935s]   File "/home/abuild/rpmbuild/BUILD/Python-3.10.0/Lib/test/test_concurrent_futures.py", line 1133, in _check_crash
[ 2935s]     res.result(timeout=self.TIMEOUT)
[ 2935s]   File "/home/abuild/rpmbuild/BUILD/Python-3.10.0/Lib/concurrent/futures/_base.py", line 447, in result
[ 2935s]     raise TimeoutError()
[ 2935s] concurrent.futures._base.TimeoutError
[ 2935s]
[ 2935s] During handling of the above exception, another exception occurred:
[ 2935s]
[ 2935s] Traceback (most recent call last):
[ 2935s]   File "/home/abuild/rpmbuild/BUILD/Python-3.10.0/Lib/test/test_concurrent_futures.py", line 1155, in test_crash_at_task_unpickle
[ 2935s]     self._check_crash(BrokenProcessPool, id, CrashAtUnpickle())
[ 2935s]   File "/home/abuild/rpmbuild/BUILD/Python-3.10.0/Lib/test/test_concurrent_futures.py", line 1137, in _check_crash
[ 2935s]     self._fail_on_deadlock(executor)
[ 2935s]   File "/home/abuild/rpmbuild/BUILD/Python-3.10.0/Lib/test/test_concurrent_futures.py", line 1114, in _fail_on_deadlock
[ 2935s]     self.fail(f"Executor deadlock:\n\n{tb}")
[ 2935s] AssertionError: Executor deadlock:
[ 2935s]
[ 2935s] Thread 0x00007fbd57fff700 (most recent call first):
[ 2935s]   File "/home/abuild/rpmbuild/BUILD/Python-3.10.0/Lib/threading.py", line 320 in wait
[ 2935s]   File "/home/abuild/rpmbuild/BUILD/Python-3.10.0/Lib/multiprocessing/queues.py", line 233 in _feed
[ 2935s]   File "/home/abuild/rpmbuild/BUILD/Python-3.10.0/Lib/threading.py", line 946 in run
[ 2935s]   File "/home/abuild/rpmbuild/BUILD/Python-3.10.0/Lib/threading.py", line 1009 in _bootstrap_inner
[ 2935s]   File "/home/abuild/rpmbuild/BUILD/Python-3.10.0/Lib/threading.py", line 966 in _bootstrap
[ 2935s]
[ 2935s] Thread 0x00007fbd74ff9700 (most recent call first):
[ 2935s]   File "/home/abuild/rpmbuild/BUILD/Python-3.10.0/Lib/selectors.py", line 416 in select
[ 2935s]   File "/home/abuild/rpmbuild/BUILD/Python-3.10.0/Lib/multiprocessing/connection.py", line 936 in wait
[ 2935s]   File "/home/abuild/rpmbuild/BUILD/Python-3.10.0/Lib/concurrent/futures/process.py", line 377 in wait_result_broken_or_wakeup
[ 2935s]   File "/home/abuild/rpmbuild/BUILD/Python-3.10.0/Lib/concurrent/futures/process.py", line 317 in run
[ 2935s]   File "/home/abuild/rpmbuild/BUILD/Python-3.10.0/Lib/threading.py", line 1009 in _bootstrap_inner
[ 2935s]   File "/home/abuild/rpmbuild/BUILD/Python-3.10.0/Lib/threading.py", line 966 in _bootstrap
[ 2935s]
[ 2935s] Current thread 0x00007fbdae8ec740 (most recent call first):
[ 2935s]   File "/home/abuild/rpmbuild/BUILD/Python-3.10.0/Lib/test/test_concurrent_futures.py", line 1105 in _fail_on_deadlock
[ 2935s]   File "/home/abuild/rpmbuild/BUILD/Python-3.10.0/Lib/test/test_concurrent_futures.py", line 1137 in _check_crash
[ 2935s]   File "/home/abuild/rpmbuild/BUILD/Python-3.10.0/Lib/test/test_concurrent_futures.py", line 1155 in test_crash_at_task_unpickle
[ 2935s]   File "/home/abuild/rpmbuild/BUILD/Python-3.10.0/Lib/unittest/case.py", line 549 in _callTestMethod
[ 2935s]   File "/home/abuild/rpmbuild/BUILD/Python-3.10.0/Lib/unittest/case.py", line 591 in run
[ 2935s]   File "/home/abuild/rpmbuild/BUILD/Python-3.10.0/Lib/unittest/case.py", line 650 in __call__
[ 2935s]   File "/home/abuild/rpmbuild/BUILD/Python-3.10.0/Lib/unittest/suite.py", line 122 in run
[ 2935s]   File "/home/abuild/rpmbuild/BUILD/Python-3.10.0/Lib/unittest/suite.py", line 84 in __call__
[ 2935s]   File "/home/abuild/rpmbuild/BUILD/Python-3.10.0/Lib/unittest/suite.py", line 122 in run
[ 2935s]   File "/home/abuild/rpmbuild/BUILD/Python-3.10.0/Lib/unittest/suite.py", line 84 in __call__
[ 2935s]   File "/home/abuild/rpmbuild/BUILD/Python-3.10.0/Lib/unittest/suite.py", line 122 in run
[ 2935s]   File "/home/abuild/rpmbuild/BUILD/Python-3.10.0/Lib/unittest/suite.py", line 84 in __call__
[ 2935s]   File "/home/abuild/rpmbuild/BUILD/Python-3.10.0/Lib/unittest/runner.py", line 176 in run
[ 2935s]   File "/home/abuild/rpmbuild/BUILD/Python-3.10.0/Lib/test/support/__init__.py", line 990 in _run_suite
[ 2935s]   File "/home/abuild/rpmbuild/BUILD/Python-3.10.0/Lib/test/support/__init__.py", line 1115 in run_unittest
[ 2935s]   File "/home/abuild/rpmbuild/BUILD/Python-3.10.0/Lib/test/libregrtest/runtest.py", line 261 in _test_module
[ 2935s]   File "/home/abuild/rpmbuild/BUILD/Python-3.10.0/Lib/test/libregrtest/runtest.py", line 297 in _runtest_inner2
[ 2935s]   File "/home/abuild/rpmbuild/BUILD/Python-3.10.0/Lib/test/libregrtest/runtest.py", line 335 in _runtest_inner
[ 2935s]   File "/home/abuild/rpmbuild/BUILD/Python-3.10.0/Lib/test/libregrtest/runtest.py", line 215 in _runtest
[ 2935s]   File "/home/abuild/rpmbuild/BUILD/Python-3.10.0/Lib/test/libregrtest/runtest.py", line 245 in runtest
[ 2935s]   File "/home/abuild/rpmbuild/BUILD/Python-3.10.0/Lib/test/libregrtest/main.py", line 337 in rerun_failed_tests
[ 2935s]   File "/home/abuild/rpmbuild/BUILD/Python-3.10.0/Lib/test/libregrtest/main.py", line 715 in _main
[ 2935s]   File "/home/abuild/rpmbuild/BUILD/Python-3.10.0/Lib/test/libregrtest/main.py", line 658 in main
[ 2935s]   File "/home/abuild/rpmbuild/BUILD/Python-3.10.0/Lib/test/libregrtest/main.py", line 736 in main
[ 2935s]   File "/home/abuild/rpmbuild/BUILD/Python-3.10.0/Lib/test/regrtest.py", line 43 in _main
[ 2935s]   File "/home/abuild/rpmbuild/BUILD/Python-3.10.0/Lib/test/regrtest.py", line 47 in <module>
[ 2935s]   File "/home/abuild/rpmbuild/BUILD/Python-3.10.0/Lib/runpy.py", line 86 in _run_code
[ 2935s]   File "/home/abuild/rpmbuild/BUILD/Python-3.10.0/Lib/runpy.py", line 196 in _run_module_as_main
[ 2935s]
[ 2935s]
[ 2935s] ======================================================================
[ 2935s] FAIL: test_crash_during_func_exec_on_worker (test.test_concurrent_futures.ProcessPoolSpawnExecutorDeadlockTest)
[ 2935s] ----------------------------------------------------------------------
[ 2935s] Traceback (most recent call last):
[ 2935s]   File "/home/abuild/rpmbuild/BUILD/Python-3.10.0/Lib/test/test_concurrent_futures.py", line 1133, in _check_crash
[ 2935s]     res.result(timeout=self.TIMEOUT)
[ 2935s]   File "/home/abuild/rpmbuild/BUILD/Python-3.10.0/Lib/concurrent/futures/_base.py", line 447, in result
[ 2935s]     raise TimeoutError()
[ 2935s] concurrent.futures._base.TimeoutError
[ 2935s]
[ 2935s] During handling of the above exception, another exception occurred:
[ 2935s]
[ 2935s] Traceback (most recent call last):
[ 2935s]   File "/home/abuild/rpmbuild/BUILD/Python-3.10.0/Lib/test/test_concurrent_futures.py", line 1159, in test_crash_during_func_exec_on_worker
[ 2935s]     self._check_crash(BrokenProcessPool, _crash)
[ 2935s]   File "/home/abuild/rpmbuild/BUILD/Python-3.10.0/Lib/test/test_concurrent_futures.py", line 1137, in _check_crash
[ 2935s]     self._fail_on_deadlock(executor)
[ 2935s]   File "/home/abuild/rpmbuild/BUILD/Python-3.10.0/Lib/test/test_concurrent_futures.py", line 1114, in _fail_on_deadlock
[ 2935s]     self.fail(f"Executor deadlock:\n\n{tb}")
[ 2935s] AssertionError: Executor deadlock:
[ 2935s]
[ 2935s] Thread 0x00007fbd57fff700 (most recent call first):
[ 2935s]   File "/home/abuild/rpmbuild/BUILD/Python-3.10.0/Lib/threading.py", line 320 in wait
[ 2935s]   File "/home/abuild/rpmbuild/BUILD/Python-3.10.0/Lib/multiprocessing/queues.py", line 233 in _feed
[ 2935s]   File "/home/abuild/rpmbuild/BUILD/Python-3.10.0/Lib/threading.py", line 946 in run
[ 2935s]   File "/home/abuild/rpmbuild/BUILD/Python-3.10.0/Lib/threading.py", line 1009 in _bootstrap_inner
[ 2935s]   File "/home/abuild/rpmbuild/BUILD/Python-3.10.0/Lib/threading.py", line 966 in _bootstrap
[ 2935s]
[ 2935s] Thread 0x00007fbd74ff9700 (most recent call first):
[ 2935s]   File "/home/abuild/rpmbuild/BUILD/Python-3.10.0/Lib/selectors.py", line 416 in select
[ 2935s]   File "/home/abuild/rpmbuild/BUILD/Python-3.10.0/Lib/multiprocessing/connection.py", line 936 in wait
[ 2935s]   File "/home/abuild/rpmbuild/BUILD/Python-3.10.0/Lib/concurrent/futures/process.py", line 377 in wait_result_broken_or_wakeup
[ 2935s]   File "/home/abuild/rpmbuild/BUILD/Python-3.10.0/Lib/concurrent/futures/process.py", line 317 in run
[ 2935s]   File "/home/abuild/rpmbuild/BUILD/Python-3.10.0/Lib/threading.py", line 1009 in _bootstrap_inner
[ 2935s]   File "/home/abuild/rpmbuild/BUILD/Python-3.10.0/Lib/threading.py", line 966 in _bootstrap
[ 2935s]
[ 2935s] Current thread 0x00007fbdae8ec740 (most recent call first):
[ 2935s]   File "/home/abuild/rpmbuild/BUILD/Python-3.10.0/Lib/test/test_concurrent_futures.py", line 1105 in _fail_on_deadlock
[ 2935s]   File "/home/abuild/rpmbuild/BUILD/Python-3.10.0/Lib/test/test_concurrent_futures.py", line 1137 in _check_crash
[ 2935s]   File "/home/abuild/rpmbuild/BUILD/Python-3.10.0/Lib/test/test_concurrent_futures.py", line 1159 in test_crash_during_func_exec_on_worker
[ 2935s]   File "/home/abuild/rpmbuild/BUILD/Python-3.10.0/Lib/unittest/case.py", line 549 in _callTestMethod
[ 2935s]   File "/home/abuild/rpmbuild/BUILD/Python-3.10.0/Lib/unittest/case.py", line 591 in run
[ 2935s]   File "/home/abuild/rpmbuild/BUILD/Python-3.10.0/Lib/unittest/case.py", line 650 in __call__
[ 2935s]   File "/home/abuild/rpmbuild/BUILD/Python-3.10.0/Lib/unittest/suite.py", line 122 in run
[ 2935s]   File "/home/abuild/rpmbuild/BUILD/Python-3.10.0/Lib/unittest/suite.py", line 84 in __call__
[ 2935s]   File "/home/abuild/rpmbuild/BUILD/Python-3.10.0/Lib/unittest/suite.py", line 122 in run
[ 2935s]   File "/home/abuild/rpmbuild/BUILD/Python-3.10.0/Lib/unittest/suite.py", line 84 in __call__
[ 2935s]   File "/home/abuild/rpmbuild/BUILD/Python-3.10.0/Lib/unittest/suite.py", line 122 in run
[ 2935s]   File "/home/abuild/rpmbuild/BUILD/Python-3.10.0/Lib/unittest/suite.py", line 84 in __call__
[ 2935s]   File "/home/abuild/rpmbuild/BUILD/Python-3.10.0/Lib/unittest/runner.py", line 176 in run
[ 2935s]   File "/home/abuild/rpmbuild/BUILD/Python-3.10.0/Lib/test/support/__init__.py", line 990 in _run_suite
[ 2935s]   File "/home/abuild/rpmbuild/BUILD/Python-3.10.0/Lib/test/support/__init__.py", line 1115 in run_unittest
[ 2935s]   File "/home/abuild/rpmbuild/BUILD/Python-3.10.0/Lib/test/libregrtest/runtest.py", line 261 in _test_module
[ 2935s]   File "/home/abuild/rpmbuild/BUILD/Python-3.10.0/Lib/test/libregrtest/runtest.py", line 297 in _runtest_inner2
[ 2935s]   File "/home/abuild/rpmbuild/BUILD/Python-3.10.0/Lib/test/libregrtest/runtest.py", line 335 in _runtest_inner
[ 2935s]   File "/home/abuild/rpmbuild/BUILD/Python-3.10.0/Lib/test/libregrtest/runtest.py", line 215 in _runtest
[ 2935s]   File "/home/abuild/rpmbuild/BUILD/Python-3.10.0/Lib/test/libregrtest/runtest.py", line 245 in runtest
[ 2935s]   File "/home/abuild/rpmbuild/BUILD/Python-3.10.0/Lib/test/libregrtest/main.py", line 337 in rerun_failed_tests
[ 2935s]   File "/home/abuild/rpmbuild/BUILD/Python-3.10.0/Lib/test/libregrtest/main.py", line 715 in _main
[ 2935s]   File "/home/abuild/rpmbuild/BUILD/Python-3.10.0/Lib/test/libregrtest/main.py", line 658 in main
[ 2935s]   File "/home/abuild/rpmbuild/BUILD/Python-3.10.0/Lib/test/libregrtest/main.py", line 736 in main
[ 2935s]   File "/home/abuild/rpmbuild/BUILD/Python-3.10.0/Lib/test/regrtest.py", line 43 in _main
[ 2935s]   File "/home/abuild/rpmbuild/BUILD/Python-3.10.0/Lib/test/regrtest.py", line 47 in <module>
[ 2935s]   File "/home/abuild/rpmbuild/BUILD/Python-3.10.0/Lib/runpy.py", line 86 in _run_code
[ 2935s]   File "/home/abuild/rpmbuild/BUILD/Python-3.10.0/Lib/runpy.py", line 196 in _run_module_as_main
[ 2935s]
[ 2935s]
[ 2935s] ======================================================================
[ 2935s] FAIL: test_crash_during_result_pickle_on_worker (test.test_concurrent_futures.ProcessPoolSpawnExecutorDeadlockTest)
[ 2935s] ----------------------------------------------------------------------
[ 2935s] test test_concurrent_futures failed
[ 2935s] Traceback (most recent call last):
[ 2935s]   File "/home/abuild/rpmbuild/BUILD/Python-3.10.0/Lib/test/test_concurrent_futures.py", line 1133, in _check_crash
[ 2935s]     res.result(timeout=self.TIMEOUT)
[ 2935s]   File "/home/abuild/rpmbuild/BUILD/Python-3.10.0/Lib/concurrent/futures/_base.py", line 447, in result
[ 2935s]     raise TimeoutError()
[ 2935s] concurrent.futures._base.TimeoutError
[ 2935s]
[ 2935s] During handling of the above exception, another exception occurred:
[ 2935s]
[ 2935s] Traceback (most recent call last):
[ 2935s]   File "/home/abuild/rpmbuild/BUILD/Python-3.10.0/Lib/test/test_concurrent_futures.py", line 1172, in test_crash_during_result_pickle_on_worker
[ 2935s]     self._check_crash(BrokenProcessPool, _return_instance, CrashAtPickle)
[ 2935s]   File "/home/abuild/rpmbuild/BUILD/Python-3.10.0/Lib/test/test_concurrent_futures.py", line 1137, in _check_crash
[ 2935s]     self._fail_on_deadlock(executor)
[ 2935s]   File "/home/abuild/rpmbuild/BUILD/Python-3.10.0/Lib/test/test_concurrent_futures.py", line 1114, in _fail_on_deadlock
[ 2935s]     self.fail(f"Executor deadlock:\n\n{tb}")
[ 2935s] AssertionError: Executor deadlock:
[ 2935s]
[ 2935s] Thread 0x00007fbd57fff700 (most recent call first):
[ 2935s]   File "/home/abuild/rpmbuild/BUILD/Python-3.10.0/Lib/threading.py", line 320 in wait
[ 2935s]   File "/home/abuild/rpmbuild/BUILD/Python-3.10.0/Lib/multiprocessing/queues.py", line 233 in _feed
[ 2935s]   File "/home/abuild/rpmbuild/BUILD/Python-3.10.0/Lib/threading.py", line 946 in run
[ 2935s]   File "/home/abuild/rpmbuild/BUILD/Python-3.10.0/Lib/threading.py", line 1009 in _bootstrap_inner
[ 2935s]   File "/home/abuild/rpmbuild/BUILD/Python-3.10.0/Lib/threading.py", line 966 in _bootstrap
[ 2935s]
[ 2935s] Thread 0x00007fbd74ff9700 (most recent call first):
[ 2935s]   File "/home/abuild/rpmbuild/BUILD/Python-3.10.0/Lib/selectors.py", line 416 in select
[ 2935s]   File "/home/abuild/rpmbuild/BUILD/Python-3.10.0/Lib/multiprocessing/connection.py", line 936 in wait
[ 2935s]   File "/home/abuild/rpmbuild/BUILD/Python-3.10.0/Lib/concurrent/futures/process.py", line 377 in wait_result_broken_or_wakeup
[ 2935s]   File "/home/abuild/rpmbuild/BUILD/Python-3.10.0/Lib/concurrent/futures/process.py", line 317 in run
[ 2935s]   File "/home/abuild/rpmbuild/BUILD/Python-3.10.0/Lib/threading.py", line 1009 in _bootstrap_inner
[ 2935s]   File "/home/abuild/rpmbuild/BUILD/Python-3.10.0/Lib/threading.py", line 966 in _bootstrap
[ 2935s]
[ 2935s] Current thread 0x00007fbdae8ec740 (most recent call first):
[ 2935s]   File "/home/abuild/rpmbuild/BUILD/Python-3.10.0/Lib/test/test_concurrent_futures.py", line 1105 in _fail_on_deadlock
[ 2935s]   File "/home/abuild/rpmbuild/BUILD/Python-3.10.0/Lib/test/test_concurrent_futures.py", line 1137 in _check_crash
[ 2935s]   File "/home/abuild/rpmbuild/BUILD/Python-3.10.0/Lib/test/test_concurrent_futures.py", line 1172 in test_crash_during_result_pickle_on_worker
[ 2935s]   File "/home/abuild/rpmbuild/BUILD/Python-3.10.0/Lib/unittest/case.py", line 549 in _callTestMethod
[ 2935s]   File "/home/abuild/rpmbuild/BUILD/Python-3.10.0/Lib/unittest/case.py", line 591 in run
[ 2935s]   File "/home/abuild/rpmbuild/BUILD/Python-3.10.0/Lib/unittest/case.py", line 650 in __call__
[ 2935s]   File "/home/abuild/rpmbuild/BUILD/Python-3.10.0/Lib/unittest/suite.py", line 122 in run
[ 2935s]   File "/home/abuild/rpmbuild/BUILD/Python-3.10.0/Lib/unittest/suite.py", line 84 in __call__
[ 2935s]   File "/home/abuild/rpmbuild/BUILD/Python-3.10.0/Lib/unittest/suite.py", line 122 in run
[ 2935s]   File "/home/abuild/rpmbuild/BUILD/Python-3.10.0/Lib/unittest/suite.py", line 84 in __call__
[ 2935s]   File "/home/abuild/rpmbuild/BUILD/Python-3.10.0/Lib/unittest/suite.py", line 122 in run
[ 2935s]   File "/home/abuild/rpmbuild/BUILD/Python-3.10.0/Lib/unittest/suite.py", line 84 in __call__
[ 2935s]   File "/home/abuild/rpmbuild/BUILD/Python-3.10.0/Lib/unittest/runner.py", line 176 in run
[ 2935s]   File "/home/abuild/rpmbuild/BUILD/Python-3.10.0/Lib/test/support/__init__.py", line 990 in _run_suite
[ 2935s]   File "/home/abuild/rpmbuild/BUILD/Python-3.10.0/Lib/test/support/__init__.py", line 1115 in run_unittest
[ 2935s]   File "/home/abuild/rpmbuild/BUILD/Python-3.10.0/Lib/test/libregrtest/runtest.py", line 261 in _test_module
[ 2935s]   File "/home/abuild/rpmbuild/BUILD/Python-3.10.0/Lib/test/libregrtest/runtest.py", line 297 in _runtest_inner2
[ 2935s]   File "/home/abuild/rpmbuild/BUILD/Python-3.10.0/Lib/test/libregrtest/runtest.py", line 335 in _runtest_inner
[ 2935s]   File "/home/abuild/rpmbuild/BUILD/Python-3.10.0/Lib/test/libregrtest/runtest.py", line 215 in _runtest
[ 2935s]   File "/home/abuild/rpmbuild/BUILD/Python-3.10.0/Lib/test/libregrtest/runtest.py", line 245 in runtest
[ 2935s]   File "/home/abuild/rpmbuild/BUILD/Python-3.10.0/Lib/test/libregrtest/main.py", line 337 in rerun_failed_tests
[ 2935s]   File "/home/abuild/rpmbuild/BUILD/Python-3.10.0/Lib/test/libregrtest/main.py", line 715 in _main
[ 2935s]   File "/home/abuild/rpmbuild/BUILD/Python-3.10.0/Lib/test/libregrtest/main.py", line 658 in main
[ 2935s]   File "/home/abuild/rpmbuild/BUILD/Python-3.10.0/Lib/test/libregrtest/main.py", line 736 in main
[ 2935s]   File "/home/abuild/rpmbuild/BUILD/Python-3.10.0/Lib/test/regrtest.py", line 43 in _main
[ 2935s]   File "/home/abuild/rpmbuild/BUILD/Python-3.10.0/Lib/test/regrtest.py", line 47 in <module>
[ 2935s]   File "/home/abuild/rpmbuild/BUILD/Python-3.10.0/Lib/runpy.py", line 86 in _run_code
[ 2935s]   File "/home/abuild/rpmbuild/BUILD/Python-3.10.0/Lib/runpy.py", line 196 in _run_module_as_main
[ 2935s]
[ 2935s]
[ 2935s] ----------------------------------------------------------------------
[ 2935s] Ran 9 tests in 697.425s
[ 2935s]
[ 2935s] FAILED (failures=9)
[ 2935s] 1 test failed again:
[ 2935s]     test_concurrent_futures


This test case is successful on the aarch64 architecture. What might cause this´╝č

(I'm very sorry. I don't know who to copy to. I choose  these developers who  recently submitted code modified file Lib/test/test_concurrent_futures.py.)
History
Date User Action Args
2021-10-12 13:37:47sxt1001setrecipients: + sxt1001, Asheesh.Laroia, serhiy.storchaka, shihai1991
2021-10-12 13:37:47sxt1001setmessageid: <1634045867.87.0.955416673386.issue45444@roundup.psfhosted.org>
2021-10-12 13:37:47sxt1001linkissue45444 messages
2021-10-12 13:37:47sxt1001create