Author pablogsal
Recipients ZackerySpytz, berker.peksag, doko, miss-islington, pablogsal, serhiy.storchaka
Date 2018-08-25.12:33:38
SpamBayes Score -1.0
Marked as misclassified Yes
Message-id <1535200418.86.0.56676864532.issue34171@psf.upfronthosting.co.za>
In-reply-to
Content
Several buildbots are failing due to commit c406d5cd74002964a64c3eb7d9e2445a7fd3a03f:

https://buildbot.python.org/all/#/builders/40/builds/709
https://buildbot.python.org/all/#/builders/21/builds/1459
https://buildbot.python.org/all/#/builders/13/builds/1476
https://buildbot.python.org/all/#/builders/53/builds/1470
https://buildbot.python.org/all/#/builders/133/builds/477
https://buildbot.python.org/all/#/builders/145/builds/327
https://buildbot.python.org/all/#/builders/85/builds/1302
https://buildbot.python.org/all/#/builders/141/builds/358
https://buildbot.python.org/all/#/builders/126/builds/564
https://buildbot.python.org/all/#/builders/147/builds/213
https://buildbot.python.org/all/#/builders/119/builds/611
https://buildbot.python.org/all/#/builders/116/builds/590
https://buildbot.python.org/all/#/builders/143/builds/233
https://buildbot.python.org/all/#/builders/93/builds/1072
https://buildbot.python.org/all/#/builders/3/builds/1257
https://buildbot.python.org/all/#/builders/32/builds/1331
https://buildbot.python.org/all/#/builders/115/builds/520
https://buildbot.python.org/all/#/builders/128/builds/571
https://buildbot.python.org/all/#/builders/99/builds/1335
https://buildbot.python.org/all/#/builders/121/builds/497
https://buildbot.python.org/all/#/builders/113/builds/540
https://buildbot.python.org/all/#/builders/154/builds/166

Sample error:

======================================================================
FAIL: test_cover_files_written_no_highlight (test.test_trace.TestCoverageCommandLineOutput)
----------------------------------------------------------------------
Traceback (most recent call last):
  File "/buildbot/buildarea/cpython/3.x.ware-gentoo-x86.nondebug/build/Lib/test/test_trace.py", line 393, in test_cover_files_written_no_highlight
    self.assertFalse(os.path.exists(tracecoverpath))
AssertionError: True is not false
----------------------------------------------------------------------
Ran 21 tests in 17.796s
FAILED (failures=1)
test test_trace failed
1 test failed again:
    test_trace
History
Date User Action Args
2018-08-25 12:33:38pablogsalsetrecipients: + pablogsal, doko, berker.peksag, serhiy.storchaka, ZackerySpytz, miss-islington
2018-08-25 12:33:38pablogsalsetmessageid: <1535200418.86.0.56676864532.issue34171@psf.upfronthosting.co.za>
2018-08-25 12:33:38pablogsallinkissue34171 messages
2018-08-25 12:33:38pablogsalcreate