Author iyogeshjoshi
Recipients Arfrever, David.Edelsohn, Edd.Barrett, Maxime Belanger, benjamin.peterson, berker.peksag, bkabrda, dmalcolm, geoffreyspear, ischwabacher, iyogeshjoshi, jcea, ned.deily, pitrou, python-dev, rpointel, vajrasky, vlee, vstinner
Date 2015-10-02.09:15:11
SpamBayes Score -1.0
Marked as misclassified Yes
Message-id <1443777311.65.0.531402556596.issue19884@psf.upfronthosting.co.za>
In-reply-to
Content
I tried applying this patch and its failing and throwing the following error:

patching file Lib/test/test_readline.py
Hunk #1 FAILED at 1.
Hunk #2 FAILED at 43.
2 out of 2 hunks FAILED -- saving rejects to file Lib/test/test_readline.py.rej
patching file Modules/readline.c
Hunk #1 FAILED at 1019.
1 out of 1 hunk FAILED -- saving rejects to file Modules/readline.c.rej

I'm using Mac Os El Captain
History
Date User Action Args
2015-10-02 09:15:11iyogeshjoshisetrecipients: + iyogeshjoshi, jcea, pitrou, vstinner, benjamin.peterson, ned.deily, Arfrever, dmalcolm, geoffreyspear, python-dev, rpointel, berker.peksag, bkabrda, David.Edelsohn, vajrasky, Edd.Barrett, ischwabacher, vlee, Maxime Belanger
2015-10-02 09:15:11iyogeshjoshisetmessageid: <1443777311.65.0.531402556596.issue19884@psf.upfronthosting.co.za>
2015-10-02 09:15:11iyogeshjoshilinkissue19884 messages
2015-10-02 09:15:11iyogeshjoshicreate