Author sxt1001
Recipients Asheesh.Laroia, serhiy.storchaka, shihai1991, sxt1001
Date 2021-10-14.00:03:12
SpamBayes Score -1.0
Marked as misclassified Yes
Message-id <1634169793.16.0.51579562399.issue45444@roundup.psfhosted.org>
In-reply-to
Content
I reproduced the same problem in Python 3-3.11.0a1 and increased two failure test cases: test_ exceptions and test_ Tools, detailed log is as follows:

[ 1937s] 0:27:53 load avg: 5.11 running: test_capi (27 min 51 sec)
[ 1966s] 0:28:23 load avg: 5.03 [423/423/3] test_capi passed (28 min 19 sec)
[ 1966s]
[ 1966s] == Tests result: FAILURE ==
[ 1966s]
[ 1966s] 401 tests OK.
[ 1966s]
[ 1966s] 10 slowest tests:
[ 1966s] - test_capi: 28 min 19 sec
[ 1966s] - test_faulthandler: 21 min 7 sec
[ 1966s] - test_concurrent_futures: 18 min 53 sec
[ 1966s] - test_io: 3 min 23 sec
[ 1966s] - test_peg_generator: 3 min 5 sec
[ 1966s] - test_subprocess: 2 min 49 sec
[ 1966s] - test_multiprocessing_spawn: 2 min 36 sec
[ 1966s] - test_audit: 2 min 15 sec
[ 1966s] - test_multiprocessing_forkserver: 1 min 43 sec
[ 1966s] - test_regrtest: 1 min 42 sec
[ 1966s]
[ 1966s] 3 tests failed:
[ 1966s]     test_concurrent_futures test_exceptions test_tools
[ 1966s]
[ 1966s] 19 tests skipped:
[ 1966s]     test_curses test_devpoll test_ioctl test_kqueue test_msilib
[ 1966s]     test_ossaudiodev test_smtpnet test_socketserver test_startfile
[ 1966s]     test_tix test_tk test_ttk_guionly test_urllib2net test_urllibnet
[ 1966s]     test_winconsoleio test_winreg test_winsound test_xmlrpc_net
[ 1966s]     test_zipfile64
[ 1966s] 0:28:23 load avg: 5.03
[ 1966s] 0:28:23 load avg: 5.03 Re-running failed tests in verbose mode
[ 1966s] 0:28:23 load avg: 5.03 Re-running test_exceptions in verbose mode (matching: test_name_error_suggestions_do_not_trigger_for_too_many_locals)
[ 1966s] test_name_error_suggestions_do_not_trigger_for_too_many_locals (test.test_exceptions.NameErrorTests) ... test test_exceptions failed
[ 1966s] FAIL
[ 1966s]
[ 1966s] ======================================================================
[ 1966s] FAIL: test_name_error_suggestions_do_not_trigger_for_too_many_locals (test.test_exceptions.NameErrorTests)
[ 1966s] ----------------------------------------------------------------------
[ 1966s] Traceback (most recent call last):
[ 1966s]   File "/home/abuild/rpmbuild/BUILD/Python-3.11.0a1/Lib/test/test_exceptions.py", line 1843, in test_name_error_suggestions_do_not_trigger_for_too_many_locals
[ 1966s]     self.assertNotIn("a1", err.getvalue())
[ 1966s]     ^^^^^^^^^^^^^^^^^^^^^^^^^^^^^^^^^^^^^^
[ 1966s] AssertionError: 'a1' unexpectedly found in 'Traceback (most recent call last):\n  File "/home/abuild/rpmbuild/BUILD/Python-3.11.0a1/Lib/test/test_exceptions.py", line 1838, in test_name_error_suggestions_do_not_trigger_for_too_many_locals\n    f()\n    ^^^\n  File "/home/abuild/rpmbuild/BUILD/Python-3.11.0a1/Lib/test/test_exceptions.py", line 1835, in f\n    print(a0)\n          ^^\nNameError: name \'a0\' is not defined\n'
[ 1966s]
[ 1966s] ----------------------------------------------------------------------
[ 1966s] Ran 1 test in 0.004s
[ 1966s]
[ 1966s] FAILED (failures=1)
[ 1966s] 0:28:23 load avg: 5.03 Re-running test_tools in verbose mode (matching: test_sundry)
[ 1966s] test_analyze_dxp_import (test.test_tools.test_sundry.TestSundryScripts) ... ok
[ 1966s] test_sundry (test.test_tools.test_sundry.TestSundryScripts) ... ERROR
[ 1966s] test_sundry_windows (test.test_tools.test_sundry.TestSundryScripts) ... test test_tools failed
[ 1966s] skipped 'Windows-only test'
[ 1966s]
[ 1966s] ======================================================================
[ 1966s] ERROR: test_sundry (test.test_tools.test_sundry.TestSundryScripts)
[ 1966s] ----------------------------------------------------------------------
[ 1966s] Traceback (most recent call last):
[ 1966s]   File "/home/abuild/rpmbuild/BUILD/Python-3.11.0a1/Lib/test/test_tools/test_sundry.py", line 43, in test_sundry
[ 1966s]     import_tool(name)
[ 1966s]     ^^^^^^^^^^^^^^^^^
[ 1966s]   File "/home/abuild/rpmbuild/BUILD/Python-3.11.0a1/Lib/test/test_tools/__init__.py", line 35, in import_tool
[ 1966s]     return importlib.import_module(toolname)
[ 1966s]            ^^^^^^^^^^^^^^^^^^^^^^^^^^^^^^^^^
[ 1966s]   File "/home/abuild/rpmbuild/BUILD/Python-3.11.0a1/Lib/importlib/__init__.py", line 126, in import_module
[ 1966s]     return _bootstrap._gcd_import(name[level:], package, level)
[ 1966s]            ^^^^^^^^^^^^^^^^^^^^^^^^^^^^^^^^^^^^^^^^^^^^^^^^^^^^
[ 1966s]   File "<frozen importlib._bootstrap>", line 1072, in _gcd_import
[ 1966s]   File "<frozen importlib._bootstrap>", line 1044, in _find_and_load
[ 1966s]   File "<frozen importlib._bootstrap>", line 1015, in _find_and_load_unlocked
[ 1966s]   File "<frozen importlib._bootstrap>", line 689, in _load_unlocked
[ 1966s]   File "<frozen importlib._bootstrap_external>", line 894, in exec_module
[ 1966s]   File "<frozen importlib._bootstrap>", line 241, in _call_with_frames_removed
[ 1966s]   File "/home/abuild/rpmbuild/BUILD/Python-3.11.0a1/Tools/scripts/freeze_modules.py", line 37, in <module>
[ 1966s]     sys.exit("ERROR: missing _freeze_module")
[ 1966s]     ^^^^^^^^^^^^^^^^^^^^^^^^^^^^^^^^^^^^^^^^^
[ 1966s] SystemExit: ERROR: missing _freeze_module
[ 1966s]
[ 1966s] ----------------------------------------------------------------------
[ 1966s] Ran 3 tests in 0.013s
[ 1966s]
[ 1966s] FAILED (errors=1, skipped=1)
[ 1966s] 0:28:23 load avg: 5.03 Re-running test_concurrent_futures in verbose mode (matching: test_crash_at_task_unpickle, test_crash_during_func_exec_on_worker, test_crash_during_result_pickle_on_worker, test_crash_at_task_unpickle, test_crash_during_func_exec_on_worker, test_crash_during_result_pickle_on_worker, test_crash_at_task_unpickle, test_crash_during_func_exec_on_worker, test_crash_during_result_pickle_on_worker)
[ 2048s] test_crash_at_task_unpickle (test.test_concurrent_futures.ProcessPoolForkExecutorDeadlockTest) ...
[ 2048s] Traceback:
[ 2048s]  Thread 0x00007fa69effd700 (most recent call first):
[ 2048s]   File "/home/abuild/rpmbuild/BUILD/Python-3.11.0a1/Lib/threading.py", line 320 in wait
[ 2048s]   File "/home/abuild/rpmbuild/BUILD/Python-3.11.0a1/Lib/multiprocessing/queues.py", line 233 in _feed
[ 2048s]   File "/home/abuild/rpmbuild/BUILD/Python-3.11.0a1/Lib/threading.py", line 968 in run
[ 2048s]   File "/home/abuild/rpmbuild/BUILD/Python-3.11.0a1/Lib/threading.py", line 1031 in _bootstrap_inner
[ 2048s]   File "/home/abuild/rpmbuild/BUILD/Python-3.11.0a1/Lib/threading.py", line 988 in _bootstrap
[ 2048s]
[ 2048s] Thread 0x00007fa6c17fa700 (most recent call first):
[ 2048s]   File "/home/abuild/rpmbuild/BUILD/Python-3.11.0a1/Lib/selectors.py", line 416 in select
[ 2048s]   File "/home/abuild/rpmbuild/BUILD/Python-3.11.0a1/Lib/multiprocessing/connection.py", line 936 in wait
[ 2048s]   File "/home/abuild/rpmbuild/BUILD/Python-3.11.0a1/Lib/concurrent/futures/process.py", line 376 in wait_result_broken_or_wakeup
[ 2048s]   File "/home/abuild/rpmbuild/BUILD/Python-3.11.0a1/Lib/concurrent/futures/process.py", line 316 in run
[ 2048s]   File "/home/abuild/rpmbuild/BUILD/Python-3.11.0a1/Lib/threading.py", line 1031 in _bootstrap_inner
[ 2048s]   File "/home/abuild/rpmbuild/BUILD/Python-3.11.0a1/Lib/threading.py", line 988 in _bootstrap
[ 2048s]
[ 2048s] Current thread 0x00007fa6e90e5740 (most recent call first):
[ 2048s]   File "/home/abuild/rpmbuild/BUILD/Python-3.11.0a1/Lib/test/test_concurrent_futures.py", line 1125 in _fail_on_deadlock
[ 2048s]   File "/home/abuild/rpmbuild/BUILD/Python-3.11.0a1/Lib/test/test_concurrent_futures.py", line 1157 in _check_crash
[ 2048s]   File "/home/abuild/rpmbuild/BUILD/Python-3.11.0a1/Lib/test/test_concurrent_futures.py", line 1175 in test_crash_at_task_unpickle
[ 2048s]   File "/home/abuild/rpmbuild/BUILD/Python-3.11.0a1/Lib/unittest/case.py", line 547 in _callTestMethod
[ 2048s]   File "/home/abuild/rpmbuild/BUILD/Python-3.11.0a1/Lib/unittest/case.py", line 591 in run
[ 2048s]   File "/home/abuild/rpmbuild/BUILD/Python-3.11.0a1/Lib/unittest/case.py", line 646 in __call__
[ 2048s]   File "/home/abuild/rpmbuild/BUILD/Python-3.11.0a1/Lib/unittest/suite.py", line 122 in run
[ 2048s]   File "/home/abuild/rpmbuild/BUILD/Python-3.11.0a1/Lib/unittest/suite.py", line 84 in __call__
[ 2048s]   File "/home/abuild/rpmbuild/BUILD/Python-3.11.0a1/Lib/unittest/suite.py", line 122 in run
[ 2048s]   File "/home/abuild/rpmbuild/BUILD/Python-3.11.0a1/Lib/unittest/suite.py", line 84 in __call__
[ 2048s]   File "/home/abuild/rpmbuild/BUILD/Python-3.11.0a1/Lib/unittest/suite.py", line 122 in run
[ 2048s]   File "/home/abuild/rpmbuild/BUILD/Python-3.11.0a1/Lib/unittest/suite.py", line 84 in __call__
[ 2048s]   File "/home/abuild/rpmbuild/BUILD/Python-3.11.0a1/Lib/unittest/runner.py", line 197 in run
[ 2048s]   File "/home/abuild/rpmbuild/BUILD/Python-3.11.0a1/Lib/test/support/__init__.py", line 992 in _run_suite
[ 2048s]   File "/home/abuild/rpmbuild/BUILD/Python-3.11.0a1/Lib/test/support/__init__.py", line 1118 in run_unittest
[ 2048s]   File "/home/abuild/rpmbuild/BUILD/Python-3.11.0a1/Lib/test/libregrtest/runtest.py", line 261 in _test_module
[ 2048s]   File "/home/abuild/rpmbuild/BUILD/Python-3.11.0a1/Lib/test/libregrtest/runtest.py", line 297 in _runtest_inner2
[ 2048s]   File "/home/abuild/rpmbuild/BUILD/Python-3.11.0a1/Lib/test/libregrtest/runtest.py", line 340 in _runtest_inner
[ 2048s]   File "/home/abuild/rpmbuild/BUILD/Python-3.11.0a1/Lib/test/libregrtest/runtest.py", line 215 in _runtest
[ 2048s]   File "/home/abuild/rpmbuild/BUILD/Python-3.11.0a1/Lib/test/libregrtest/runtest.py", line 245 in runtest
[ 2048s]   File "/home/abuild/rpmbuild/BUILD/Python-3.11.0a1/Lib/test/libregrtest/main.py", line 337 in rerun_failed_tests
[ 2048s]   File "/home/abuild/rpmbuild/BUILD/Python-3.11.0a1/Lib/test/libregrtest/main.py", line 715 in _main
[ 2048s]   File "/home/abuild/rpmbuild/BUILD/Python-3.11.0a1/Lib/test/libregrtest/main.py", line 658 in main
[ 2048s]   File "/home/abuild/rpmbuild/BUILD/Python-3.11.0a1/Lib/test/libregrtest/main.py", line 736 in main
[ 2048s]   File "/home/abuild/rpmbuild/BUILD/Python-3.11.0a1/Lib/test/regrtest.py", line 43 in _main
[ 2048s]   File "/home/abuild/rpmbuild/BUILD/Python-3.11.0a1/Lib/test/regrtest.py", line 47 in <module>
[ 2048s]   File "/home/abuild/rpmbuild/BUILD/Python-3.11.0a1/Lib/runpy.py", line 86 in _run_code
[ 2048s]   File "/home/abuild/rpmbuild/BUILD/Python-3.11.0a1/Lib/runpy.py", line 196 in _run_module_as_main
[ 2048s]
[ 2048s] FAIL
[ 2132s] 81.93s test_crash_during_func_exec_on_worker (test.test_concurrent_futures.ProcessPoolForkExecutorDeadlockTest) ...
[ 2132s] Traceback:
[ 2132s]  Thread 0x00007fa69effd700 (most recent call first):
[ 2132s]   File "/home/abuild/rpmbuild/BUILD/Python-3.11.0a1/Lib/threading.py", line 320 in wait
[ 2132s]   File "/home/abuild/rpmbuild/BUILD/Python-3.11.0a1/Lib/multiprocessing/queues.py", line 233 in _feed
[ 2132s]   File "/home/abuild/rpmbuild/BUILD/Python-3.11.0a1/Lib/threading.py", line 968 in run
[ 2132s]   File "/home/abuild/rpmbuild/BUILD/Python-3.11.0a1/Lib/threading.py", line 1031 in _bootstrap_inner
[ 2132s]   File "/home/abuild/rpmbuild/BUILD/Python-3.11.0a1/Lib/threading.py", line 988 in _bootstrap
[ 2132s]
[ 2132s] Thread 0x00007fa6c17fa700 (most recent call first):
[ 2132s]   File "/home/abuild/rpmbuild/BUILD/Python-3.11.0a1/Lib/selectors.py", line 416 in select
[ 2132s]   File "/home/abuild/rpmbuild/BUILD/Python-3.11.0a1/Lib/multiprocessing/connection.py", line 936 in wait
[ 2132s]   File "/home/abuild/rpmbuild/BUILD/Python-3.11.0a1/Lib/concurrent/futures/process.py", line 376 in wait_result_broken_or_wakeup
[ 2132s]   File "/home/abuild/rpmbuild/BUILD/Python-3.11.0a1/Lib/concurrent/futures/process.py", line 316 in run
[ 2132s]   File "/home/abuild/rpmbuild/BUILD/Python-3.11.0a1/Lib/threading.py", line 1031 in _bootstrap_inner
[ 2132s]   File "/home/abuild/rpmbuild/BUILD/Python-3.11.0a1/Lib/threading.py", line 988 in _bootstrap
[ 2132s]
[ 2132s] Current thread 0x00007fa6e90e5740 (most recent call first):
[ 2132s]   File "/home/abuild/rpmbuild/BUILD/Python-3.11.0a1/Lib/test/test_concurrent_futures.py", line 1125 in _fail_on_deadlock
[ 2132s]   File "/home/abuild/rpmbuild/BUILD/Python-3.11.0a1/Lib/test/test_concurrent_futures.py", line 1157 in _check_crash
[ 2132s]   File "/home/abuild/rpmbuild/BUILD/Python-3.11.0a1/Lib/test/test_concurrent_futures.py", line 1179 in test_crash_during_func_exec_on_worker
[ 2132s]   File "/home/abuild/rpmbuild/BUILD/Python-3.11.0a1/Lib/unittest/case.py", line 547 in _callTestMethod
[ 2132s]   File "/home/abuild/rpmbuild/BUILD/Python-3.11.0a1/Lib/unittest/case.py", line 591 in run
[ 2132s]   File "/home/abuild/rpmbuild/BUILD/Python-3.11.0a1/Lib/unittest/case.py", line 646 in __call__
[ 2132s]   File "/home/abuild/rpmbuild/BUILD/Python-3.11.0a1/Lib/unittest/suite.py", line 122 in run
[ 2132s]   File "/home/abuild/rpmbuild/BUILD/Python-3.11.0a1/Lib/unittest/suite.py", line 84 in __call__
[ 2132s]   File "/home/abuild/rpmbuild/BUILD/Python-3.11.0a1/Lib/unittest/suite.py", line 122 in run
[ 2132s]   File "/home/abuild/rpmbuild/BUILD/Python-3.11.0a1/Lib/unittest/suite.py", line 84 in __call__
[ 2132s]   File "/home/abuild/rpmbuild/BUILD/Python-3.11.0a1/Lib/unittest/suite.py", line 122 in run
[ 2132s]   File "/home/abuild/rpmbuild/BUILD/Python-3.11.0a1/Lib/unittest/suite.py", line 84 in __call__
[ 2132s]   File "/home/abuild/rpmbuild/BUILD/Python-3.11.0a1/Lib/unittest/runner.py", line 197 in run
[ 2132s]   File "/home/abuild/rpmbuild/BUILD/Python-3.11.0a1/Lib/test/support/__init__.py", line 992 in _run_suite
[ 2132s]   File "/home/abuild/rpmbuild/BUILD/Python-3.11.0a1/Lib/test/support/__init__.py", line 1118 in run_unittest
[ 2132s]   File "/home/abuild/rpmbuild/BUILD/Python-3.11.0a1/Lib/test/libregrtest/runtest.py", line 261 in _test_module
[ 2132s]   File "/home/abuild/rpmbuild/BUILD/Python-3.11.0a1/Lib/test/libregrtest/runtest.py", line 297 in _runtest_inner2
[ 2132s]   File "/home/abuild/rpmbuild/BUILD/Python-3.11.0a1/Lib/test/libregrtest/runtest.py", line 340 in _runtest_inner
[ 2132s]   File "/home/abuild/rpmbuild/BUILD/Python-3.11.0a1/Lib/test/libregrtest/runtest.py", line 215 in _runtest
[ 2132s]   File "/home/abuild/rpmbuild/BUILD/Python-3.11.0a1/Lib/test/libregrtest/runtest.py", line 245 in runtest
[ 2132s]   File "/home/abuild/rpmbuild/BUILD/Python-3.11.0a1/Lib/test/libregrtest/main.py", line 337 in rerun_failed_tests
[ 2132s]   File "/home/abuild/rpmbuild/BUILD/Python-3.11.0a1/Lib/test/libregrtest/main.py", line 715 in _main
[ 2132s]   File "/home/abuild/rpmbuild/BUILD/Python-3.11.0a1/Lib/test/libregrtest/main.py", line 658 in main
[ 2132s]   File "/home/abuild/rpmbuild/BUILD/Python-3.11.0a1/Lib/test/libregrtest/main.py", line 736 in main
[ 2132s]   File "/home/abuild/rpmbuild/BUILD/Python-3.11.0a1/Lib/test/regrtest.py", line 43 in _main
[ 2132s]   File "/home/abuild/rpmbuild/BUILD/Python-3.11.0a1/Lib/test/regrtest.py", line 47 in <module>
[ 2132s]   File "/home/abuild/rpmbuild/BUILD/Python-3.11.0a1/Lib/runpy.py", line 86 in _run_code
[ 2132s]   File "/home/abuild/rpmbuild/BUILD/Python-3.11.0a1/Lib/runpy.py", line 196 in _run_module_as_main
[ 2132s]
[ 2132s] FAIL
[ 2216s] 83.91s test_crash_during_result_pickle_on_worker (test.test_concurrent_futures.ProcessPoolForkExecutorDeadlockTest) ...
[ 2216s] Traceback:
[ 2216s]  Thread 0x00007fa69effd700 (most recent call first):
[ 2216s]   File "/home/abuild/rpmbuild/BUILD/Python-3.11.0a1/Lib/threading.py", line 320 in wait
[ 2216s]   File "/home/abuild/rpmbuild/BUILD/Python-3.11.0a1/Lib/multiprocessing/queues.py", line 233 in _feed
[ 2216s]   File "/home/abuild/rpmbuild/BUILD/Python-3.11.0a1/Lib/threading.py", line 968 in run
[ 2216s]   File "/home/abuild/rpmbuild/BUILD/Python-3.11.0a1/Lib/threading.py", line 1031 in _bootstrap_inner
[ 2216s]   File "/home/abuild/rpmbuild/BUILD/Python-3.11.0a1/Lib/threading.py", line 988 in _bootstrap
[ 2216s]
[ 2216s] Thread 0x00007fa6c17fa700 (most recent call first):
[ 2216s]   File "/home/abuild/rpmbuild/BUILD/Python-3.11.0a1/Lib/selectors.py", line 416 in select
[ 2216s]   File "/home/abuild/rpmbuild/BUILD/Python-3.11.0a1/Lib/multiprocessing/connection.py", line 936 in wait
[ 2216s]   File "/home/abuild/rpmbuild/BUILD/Python-3.11.0a1/Lib/concurrent/futures/process.py", line 376 in wait_result_broken_or_wakeup
[ 2216s]   File "/home/abuild/rpmbuild/BUILD/Python-3.11.0a1/Lib/concurrent/futures/process.py", line 316 in run
[ 2216s]   File "/home/abuild/rpmbuild/BUILD/Python-3.11.0a1/Lib/threading.py", line 1031 in _bootstrap_inner
[ 2216s]   File "/home/abuild/rpmbuild/BUILD/Python-3.11.0a1/Lib/threading.py", line 988 in _bootstrap
[ 2216s]
[ 2216s] Current thread 0x00007fa6e90e5740 (most recent call first):
[ 2216s]   File "/home/abuild/rpmbuild/BUILD/Python-3.11.0a1/Lib/test/test_concurrent_futures.py", line 1125 in _fail_on_deadlock
[ 2216s]   File "/home/abuild/rpmbuild/BUILD/Python-3.11.0a1/Lib/test/test_concurrent_futures.py", line 1157 in _check_crash
[ 2216s]   File "/home/abuild/rpmbuild/BUILD/Python-3.11.0a1/Lib/test/test_concurrent_futures.py", line 1192 in test_crash_during_result_pickle_on_worker
[ 2216s]   File "/home/abuild/rpmbuild/BUILD/Python-3.11.0a1/Lib/unittest/case.py", line 547 in _callTestMethod
[ 2216s]   File "/home/abuild/rpmbuild/BUILD/Python-3.11.0a1/Lib/unittest/case.py", line 591 in run
[ 2216s]   File "/home/abuild/rpmbuild/BUILD/Python-3.11.0a1/Lib/unittest/case.py", line 646 in __call__
[ 2216s]   File "/home/abuild/rpmbuild/BUILD/Python-3.11.0a1/Lib/unittest/suite.py", line 122 in run
[ 2216s]   File "/home/abuild/rpmbuild/BUILD/Python-3.11.0a1/Lib/unittest/suite.py", line 84 in __call__
[ 2216s]   File "/home/abuild/rpmbuild/BUILD/Python-3.11.0a1/Lib/unittest/suite.py", line 122 in run
[ 2216s]   File "/home/abuild/rpmbuild/BUILD/Python-3.11.0a1/Lib/unittest/suite.py", line 84 in __call__
[ 2216s]   File "/home/abuild/rpmbuild/BUILD/Python-3.11.0a1/Lib/unittest/suite.py", line 122 in run
[ 2216s]   File "/home/abuild/rpmbuild/BUILD/Python-3.11.0a1/Lib/unittest/suite.py", line 84 in __call__
[ 2216s]   File "/home/abuild/rpmbuild/BUILD/Python-3.11.0a1/Lib/unittest/runner.py", line 197 in run
[ 2216s]   File "/home/abuild/rpmbuild/BUILD/Python-3.11.0a1/Lib/test/support/__init__.py", line 992 in _run_suite
[ 2216s]   File "/home/abuild/rpmbuild/BUILD/Python-3.11.0a1/Lib/test/support/__init__.py", line 1118 in run_unittest
[ 2216s]   File "/home/abuild/rpmbuild/BUILD/Python-3.11.0a1/Lib/test/libregrtest/runtest.py", line 261 in _test_module
[ 2216s]   File "/home/abuild/rpmbuild/BUILD/Python-3.11.0a1/Lib/test/libregrtest/runtest.py", line 297 in _runtest_inner2
[ 2216s]   File "/home/abuild/rpmbuild/BUILD/Python-3.11.0a1/Lib/test/libregrtest/runtest.py", line 340 in _runtest_inner
[ 2216s]   File "/home/abuild/rpmbuild/BUILD/Python-3.11.0a1/Lib/test/libregrtest/runtest.py", line 215 in _runtest
[ 2216s]   File "/home/abuild/rpmbuild/BUILD/Python-3.11.0a1/Lib/test/libregrtest/runtest.py", line 245 in runtest
[ 2216s]   File "/home/abuild/rpmbuild/BUILD/Python-3.11.0a1/Lib/test/libregrtest/main.py", line 337 in rerun_failed_tests
[ 2216s]   File "/home/abuild/rpmbuild/BUILD/Python-3.11.0a1/Lib/test/libregrtest/main.py", line 715 in _main
[ 2216s]   File "/home/abuild/rpmbuild/BUILD/Python-3.11.0a1/Lib/test/libregrtest/main.py", line 658 in main
[ 2216s]   File "/home/abuild/rpmbuild/BUILD/Python-3.11.0a1/Lib/test/libregrtest/main.py", line 736 in main
[ 2216s]   File "/home/abuild/rpmbuild/BUILD/Python-3.11.0a1/Lib/test/regrtest.py", line 43 in _main
[ 2216s]   File "/home/abuild/rpmbuild/BUILD/Python-3.11.0a1/Lib/test/regrtest.py", line 47 in <module>
[ 2216s]   File "/home/abuild/rpmbuild/BUILD/Python-3.11.0a1/Lib/runpy.py", line 86 in _run_code
[ 2216s]   File "/home/abuild/rpmbuild/BUILD/Python-3.11.0a1/Lib/runpy.py", line 196 in _run_module_as_main
[ 2216s]
[ 2216s] FAIL
[ 2294s] 84.36s test_crash_at_task_unpickle (test.test_concurrent_futures.ProcessPoolForkserverExecutorDeadlockTest) ...
[ 2294s] Traceback:
[ 2294s]  Thread 0x00007fa69effd700 (most recent call first):
[ 2294s]   File "/home/abuild/rpmbuild/BUILD/Python-3.11.0a1/Lib/threading.py", line 320 in wait
[ 2294s]   File "/home/abuild/rpmbuild/BUILD/Python-3.11.0a1/Lib/multiprocessing/queues.py", line 233 in _feed
[ 2294s]   File "/home/abuild/rpmbuild/BUILD/Python-3.11.0a1/Lib/threading.py", line 968 in run
[ 2294s]   File "/home/abuild/rpmbuild/BUILD/Python-3.11.0a1/Lib/threading.py", line 1031 in _bootstrap_inner
[ 2294s]   File "/home/abuild/rpmbuild/BUILD/Python-3.11.0a1/Lib/threading.py", line 988 in _bootstrap
[ 2294s]
[ 2294s] Thread 0x00007fa6c17fa700 (most recent call first):
[ 2294s]   File "/home/abuild/rpmbuild/BUILD/Python-3.11.0a1/Lib/selectors.py", line 416 in select
[ 2294s]   File "/home/abuild/rpmbuild/BUILD/Python-3.11.0a1/Lib/multiprocessing/connection.py", line 936 in wait
[ 2294s]   File "/home/abuild/rpmbuild/BUILD/Python-3.11.0a1/Lib/concurrent/futures/process.py", line 376 in wait_result_broken_or_wakeup
[ 2294s]   File "/home/abuild/rpmbuild/BUILD/Python-3.11.0a1/Lib/concurrent/futures/process.py", line 316 in run
[ 2294s]   File "/home/abuild/rpmbuild/BUILD/Python-3.11.0a1/Lib/threading.py", line 1031 in _bootstrap_inner
[ 2294s]   File "/home/abuild/rpmbuild/BUILD/Python-3.11.0a1/Lib/threading.py", line 988 in _bootstrap
[ 2294s]
[ 2294s] Current thread 0x00007fa6e90e5740 (most recent call first):
[ 2294s]   File "/home/abuild/rpmbuild/BUILD/Python-3.11.0a1/Lib/test/test_concurrent_futures.py", line 1125 in _fail_on_deadlock
[ 2294s]   File "/home/abuild/rpmbuild/BUILD/Python-3.11.0a1/Lib/test/test_concurrent_futures.py", line 1157 in _check_crash
[ 2294s]   File "/home/abuild/rpmbuild/BUILD/Python-3.11.0a1/Lib/test/test_concurrent_futures.py", line 1175 in test_crash_at_task_unpickle
[ 2294s]   File "/home/abuild/rpmbuild/BUILD/Python-3.11.0a1/Lib/unittest/case.py", line 547 in _callTestMethod
[ 2294s]   File "/home/abuild/rpmbuild/BUILD/Python-3.11.0a1/Lib/unittest/case.py", line 591 in run
[ 2294s]   File "/home/abuild/rpmbuild/BUILD/Python-3.11.0a1/Lib/unittest/case.py", line 646 in __call__
[ 2294s]   File "/home/abuild/rpmbuild/BUILD/Python-3.11.0a1/Lib/unittest/suite.py", line 122 in run
[ 2294s]   File "/home/abuild/rpmbuild/BUILD/Python-3.11.0a1/Lib/unittest/suite.py", line 84 in __call__
[ 2294s]   File "/home/abuild/rpmbuild/BUILD/Python-3.11.0a1/Lib/unittest/suite.py", line 122 in run
[ 2294s]   File "/home/abuild/rpmbuild/BUILD/Python-3.11.0a1/Lib/unittest/suite.py", line 84 in __call__
[ 2294s]   File "/home/abuild/rpmbuild/BUILD/Python-3.11.0a1/Lib/unittest/suite.py", line 122 in run
[ 2294s]   File "/home/abuild/rpmbuild/BUILD/Python-3.11.0a1/Lib/unittest/suite.py", line 84 in __call__
[ 2294s]   File "/home/abuild/rpmbuild/BUILD/Python-3.11.0a1/Lib/unittest/runner.py", line 197 in run
[ 2294s]   File "/home/abuild/rpmbuild/BUILD/Python-3.11.0a1/Lib/test/support/__init__.py", line 992 in _run_suite
[ 2294s]   File "/home/abuild/rpmbuild/BUILD/Python-3.11.0a1/Lib/test/support/__init__.py", line 1118 in run_unittest
[ 2294s]   File "/home/abuild/rpmbuild/BUILD/Python-3.11.0a1/Lib/test/libregrtest/runtest.py", line 261 in _test_module
[ 2294s]   File "/home/abuild/rpmbuild/BUILD/Python-3.11.0a1/Lib/test/libregrtest/runtest.py", line 297 in _runtest_inner2
[ 2294s]   File "/home/abuild/rpmbuild/BUILD/Python-3.11.0a1/Lib/test/libregrtest/runtest.py", line 340 in _runtest_inner
[ 2294s]   File "/home/abuild/rpmbuild/BUILD/Python-3.11.0a1/Lib/test/libregrtest/runtest.py", line 215 in _runtest
[ 2294s]   File "/home/abuild/rpmbuild/BUILD/Python-3.11.0a1/Lib/test/libregrtest/runtest.py", line 245 in runtest
[ 2294s]   File "/home/abuild/rpmbuild/BUILD/Python-3.11.0a1/Lib/test/libregrtest/main.py", line 337 in rerun_failed_tests
[ 2294s]   File "/home/abuild/rpmbuild/BUILD/Python-3.11.0a1/Lib/test/libregrtest/main.py", line 715 in _main
[ 2294s]   File "/home/abuild/rpmbuild/BUILD/Python-3.11.0a1/Lib/test/libregrtest/main.py", line 658 in main
[ 2294s]   File "/home/abuild/rpmbuild/BUILD/Python-3.11.0a1/Lib/test/libregrtest/main.py", line 736 in main
[ 2294s]   File "/home/abuild/rpmbuild/BUILD/Python-3.11.0a1/Lib/test/regrtest.py", line 43 in _main
[ 2294s]   File "/home/abuild/rpmbuild/BUILD/Python-3.11.0a1/Lib/test/regrtest.py", line 47 in <module>
[ 2294s]   File "/home/abuild/rpmbuild/BUILD/Python-3.11.0a1/Lib/runpy.py", line 86 in _run_code
[ 2294s]   File "/home/abuild/rpmbuild/BUILD/Python-3.11.0a1/Lib/runpy.py", line 196 in _run_module_as_main
[ 2294s]
[ 2294s] FAIL
[ 2374s] 77.53s test_crash_during_func_exec_on_worker (test.test_concurrent_futures.ProcessPoolForkserverExecutorDeadlockTest) ...
[ 2374s] Traceback:
[ 2374s]  Thread 0x00007fa69effd700 (most recent call first):
[ 2374s]   File "/home/abuild/rpmbuild/BUILD/Python-3.11.0a1/Lib/threading.py", line 320 in wait
[ 2374s]   File "/home/abuild/rpmbuild/BUILD/Python-3.11.0a1/Lib/multiprocessing/queues.py", line 233 in _feed
[ 2374s]   File "/home/abuild/rpmbuild/BUILD/Python-3.11.0a1/Lib/threading.py", line 968 in run
[ 2374s]   File "/home/abuild/rpmbuild/BUILD/Python-3.11.0a1/Lib/threading.py", line 1031 in _bootstrap_inner
[ 2374s]   File "/home/abuild/rpmbuild/BUILD/Python-3.11.0a1/Lib/threading.py", line 988 in _bootstrap
[ 2374s]
[ 2374s] Thread 0x00007fa6c17fa700 (most recent call first):
[ 2374s]   File "/home/abuild/rpmbuild/BUILD/Python-3.11.0a1/Lib/selectors.py", line 416 in select
[ 2374s]   File "/home/abuild/rpmbuild/BUILD/Python-3.11.0a1/Lib/multiprocessing/connection.py", line 936 in wait
[ 2374s]   File "/home/abuild/rpmbuild/BUILD/Python-3.11.0a1/Lib/concurrent/futures/process.py", line 376 in wait_result_broken_or_wakeup
[ 2374s]   File "/home/abuild/rpmbuild/BUILD/Python-3.11.0a1/Lib/concurrent/futures/process.py", line 316 in run
[ 2374s]   File "/home/abuild/rpmbuild/BUILD/Python-3.11.0a1/Lib/threading.py", line 1031 in _bootstrap_inner
[ 2374s]   File "/home/abuild/rpmbuild/BUILD/Python-3.11.0a1/Lib/threading.py", line 988 in _bootstrap
[ 2374s]
[ 2374s] Current thread 0x00007fa6e90e5740 (most recent call first):
[ 2374s]   File "/home/abuild/rpmbuild/BUILD/Python-3.11.0a1/Lib/test/test_concurrent_futures.py", line 1125 in _fail_on_deadlock
[ 2374s]   File "/home/abuild/rpmbuild/BUILD/Python-3.11.0a1/Lib/test/test_concurrent_futures.py", line 1157 in _check_crash
[ 2374s]   File "/home/abuild/rpmbuild/BUILD/Python-3.11.0a1/Lib/test/test_concurrent_futures.py", line 1179 in test_crash_during_func_exec_on_worker
[ 2374s]   File "/home/abuild/rpmbuild/BUILD/Python-3.11.0a1/Lib/unittest/case.py", line 547 in _callTestMethod
[ 2374s]   File "/home/abuild/rpmbuild/BUILD/Python-3.11.0a1/Lib/unittest/case.py", line 591 in run
[ 2374s]   File "/home/abuild/rpmbuild/BUILD/Python-3.11.0a1/Lib/unittest/case.py", line 646 in __call__
[ 2374s]   File "/home/abuild/rpmbuild/BUILD/Python-3.11.0a1/Lib/unittest/suite.py", line 122 in run
[ 2374s]   File "/home/abuild/rpmbuild/BUILD/Python-3.11.0a1/Lib/unittest/suite.py", line 84 in __call__
[ 2374s]   File "/home/abuild/rpmbuild/BUILD/Python-3.11.0a1/Lib/unittest/suite.py", line 122 in run
[ 2374s]   File "/home/abuild/rpmbuild/BUILD/Python-3.11.0a1/Lib/unittest/suite.py", line 84 in __call__
[ 2374s]   File "/home/abuild/rpmbuild/BUILD/Python-3.11.0a1/Lib/unittest/suite.py", line 122 in run
[ 2374s]   File "/home/abuild/rpmbuild/BUILD/Python-3.11.0a1/Lib/unittest/suite.py", line 84 in __call__
[ 2374s]   File "/home/abuild/rpmbuild/BUILD/Python-3.11.0a1/Lib/unittest/runner.py", line 197 in run
[ 2374s]   File "/home/abuild/rpmbuild/BUILD/Python-3.11.0a1/Lib/test/support/__init__.py", line 992 in _run_suite
[ 2374s]   File "/home/abuild/rpmbuild/BUILD/Python-3.11.0a1/Lib/test/support/__init__.py", line 1118 in run_unittest
[ 2374s]   File "/home/abuild/rpmbuild/BUILD/Python-3.11.0a1/Lib/test/libregrtest/runtest.py", line 261 in _test_module
[ 2374s]   File "/home/abuild/rpmbuild/BUILD/Python-3.11.0a1/Lib/test/libregrtest/runtest.py", line 297 in _runtest_inner2
[ 2374s]   File "/home/abuild/rpmbuild/BUILD/Python-3.11.0a1/Lib/test/libregrtest/runtest.py", line 340 in _runtest_inner
[ 2374s]   File "/home/abuild/rpmbuild/BUILD/Python-3.11.0a1/Lib/test/libregrtest/runtest.py", line 215 in _runtest
[ 2374s]   File "/home/abuild/rpmbuild/BUILD/Python-3.11.0a1/Lib/test/libregrtest/runtest.py", line 245 in runtest
[ 2374s]   File "/home/abuild/rpmbuild/BUILD/Python-3.11.0a1/Lib/test/libregrtest/main.py", line 337 in rerun_failed_tests
[ 2374s]   File "/home/abuild/rpmbuild/BUILD/Python-3.11.0a1/Lib/test/libregrtest/main.py", line 715 in _main
[ 2374s]   File "/home/abuild/rpmbuild/BUILD/Python-3.11.0a1/Lib/test/libregrtest/main.py", line 658 in main
[ 2374s]   File "/home/abuild/rpmbuild/BUILD/Python-3.11.0a1/Lib/test/libregrtest/main.py", line 736 in main
[ 2374s]   File "/home/abuild/rpmbuild/BUILD/Python-3.11.0a1/Lib/test/regrtest.py", line 43 in _main
[ 2374s]   File "/home/abuild/rpmbuild/BUILD/Python-3.11.0a1/Lib/test/regrtest.py", line 47 in <module>
[ 2374s]   File "/home/abuild/rpmbuild/BUILD/Python-3.11.0a1/Lib/runpy.py", line 86 in _run_code
[ 2374s]   File "/home/abuild/rpmbuild/BUILD/Python-3.11.0a1/Lib/runpy.py", line 196 in _run_module_as_main
[ 2374s]
[ 2374s] FAIL
[ 2453s] 80.34s test_crash_during_result_pickle_on_worker (test.test_concurrent_futures.ProcessPoolForkserverExecutorDeadlockTest) ...
[ 2453s] Traceback:
[ 2453s]  Thread 0x00007fa69effd700 (most recent call first):
[ 2453s]   File "/home/abuild/rpmbuild/BUILD/Python-3.11.0a1/Lib/threading.py", line 320 in wait
[ 2453s]   File "/home/abuild/rpmbuild/BUILD/Python-3.11.0a1/Lib/multiprocessing/queues.py", line 233 in _feed
[ 2453s]   File "/home/abuild/rpmbuild/BUILD/Python-3.11.0a1/Lib/threading.py", line 968 in run
[ 2453s]   File "/home/abuild/rpmbuild/BUILD/Python-3.11.0a1/Lib/threading.py", line 1031 in _bootstrap_inner
[ 2453s]   File "/home/abuild/rpmbuild/BUILD/Python-3.11.0a1/Lib/threading.py", line 988 in _bootstrap
[ 2453s]
[ 2453s] Thread 0x00007fa6c17fa700 (most recent call first):
[ 2453s]   File "/home/abuild/rpmbuild/BUILD/Python-3.11.0a1/Lib/selectors.py", line 416 in select
[ 2453s]   File "/home/abuild/rpmbuild/BUILD/Python-3.11.0a1/Lib/multiprocessing/connection.py", line 936 in wait
[ 2453s]   File "/home/abuild/rpmbuild/BUILD/Python-3.11.0a1/Lib/concurrent/futures/process.py", line 376 in wait_result_broken_or_wakeup
[ 2453s]   File "/home/abuild/rpmbuild/BUILD/Python-3.11.0a1/Lib/concurrent/futures/process.py", line 316 in run
[ 2453s]   File "/home/abuild/rpmbuild/BUILD/Python-3.11.0a1/Lib/threading.py", line 1031 in _bootstrap_inner
[ 2453s]   File "/home/abuild/rpmbuild/BUILD/Python-3.11.0a1/Lib/threading.py", line 988 in _bootstrap
[ 2453s]
[ 2453s] Current thread 0x00007fa6e90e5740 (most recent call first):
[ 2453s]   File "/home/abuild/rpmbuild/BUILD/Python-3.11.0a1/Lib/test/test_concurrent_futures.py", line 1125 in _fail_on_deadlock
[ 2453s]   File "/home/abuild/rpmbuild/BUILD/Python-3.11.0a1/Lib/test/test_concurrent_futures.py", line 1157 in _check_crash
[ 2453s]   File "/home/abuild/rpmbuild/BUILD/Python-3.11.0a1/Lib/test/test_concurrent_futures.py", line 1192 in test_crash_during_result_pickle_on_worker
[ 2453s]   File "/home/abuild/rpmbuild/BUILD/Python-3.11.0a1/Lib/unittest/case.py", line 547 in _callTestMethod
[ 2453s]   File "/home/abuild/rpmbuild/BUILD/Python-3.11.0a1/Lib/unittest/case.py", line 591 in run
[ 2453s]   File "/home/abuild/rpmbuild/BUILD/Python-3.11.0a1/Lib/unittest/case.py", line 646 in __call__
[ 2453s]   File "/home/abuild/rpmbuild/BUILD/Python-3.11.0a1/Lib/unittest/suite.py", line 122 in run
[ 2453s]   File "/home/abuild/rpmbuild/BUILD/Python-3.11.0a1/Lib/unittest/suite.py", line 84 in __call__
[ 2453s]   File "/home/abuild/rpmbuild/BUILD/Python-3.11.0a1/Lib/unittest/suite.py", line 122 in run
[ 2453s]   File "/home/abuild/rpmbuild/BUILD/Python-3.11.0a1/Lib/unittest/suite.py", line 84 in __call__
[ 2453s]   File "/home/abuild/rpmbuild/BUILD/Python-3.11.0a1/Lib/unittest/suite.py", line 122 in run
[ 2453s]   File "/home/abuild/rpmbuild/BUILD/Python-3.11.0a1/Lib/unittest/suite.py", line 84 in __call__
[ 2453s]   File "/home/abuild/rpmbuild/BUILD/Python-3.11.0a1/Lib/unittest/runner.py", line 197 in run
[ 2453s]   File "/home/abuild/rpmbuild/BUILD/Python-3.11.0a1/Lib/test/support/__init__.py", line 992 in _run_suite
[ 2453s]   File "/home/abuild/rpmbuild/BUILD/Python-3.11.0a1/Lib/test/support/__init__.py", line 1118 in run_unittest
[ 2453s]   File "/home/abuild/rpmbuild/BUILD/Python-3.11.0a1/Lib/test/libregrtest/runtest.py", line 261 in _test_module
[ 2453s]   File "/home/abuild/rpmbuild/BUILD/Python-3.11.0a1/Lib/test/libregrtest/runtest.py", line 297 in _runtest_inner2
[ 2453s]   File "/home/abuild/rpmbuild/BUILD/Python-3.11.0a1/Lib/test/libregrtest/runtest.py", line 340 in _runtest_inner
[ 2453s]   File "/home/abuild/rpmbuild/BUILD/Python-3.11.0a1/Lib/test/libregrtest/runtest.py", line 215 in _runtest
[ 2453s]   File "/home/abuild/rpmbuild/BUILD/Python-3.11.0a1/Lib/test/libregrtest/runtest.py", line 245 in runtest
[ 2453s]   File "/home/abuild/rpmbuild/BUILD/Python-3.11.0a1/Lib/test/libregrtest/main.py", line 337 in rerun_failed_tests
[ 2453s]   File "/home/abuild/rpmbuild/BUILD/Python-3.11.0a1/Lib/test/libregrtest/main.py", line 715 in _main
[ 2453s]   File "/home/abuild/rpmbuild/BUILD/Python-3.11.0a1/Lib/test/libregrtest/main.py", line 658 in main
[ 2453s]   File "/home/abuild/rpmbuild/BUILD/Python-3.11.0a1/Lib/test/libregrtest/main.py", line 736 in main
[ 2453s]   File "/home/abuild/rpmbuild/BUILD/Python-3.11.0a1/Lib/test/regrtest.py", line 43 in _main
[ 2453s]   File "/home/abuild/rpmbuild/BUILD/Python-3.11.0a1/Lib/test/regrtest.py", line 47 in <module>
[ 2453s]   File "/home/abuild/rpmbuild/BUILD/Python-3.11.0a1/Lib/runpy.py", line 86 in _run_code
[ 2453s]   File "/home/abuild/rpmbuild/BUILD/Python-3.11.0a1/Lib/runpy.py", line 196 in _run_module_as_main
[ 2453s]
[ 2453s] FAIL
[ 2530s] 78.50s test_crash_at_task_unpickle (test.test_concurrent_futures.ProcessPoolSpawnExecutorDeadlockTest) ...
[ 2530s] Traceback:
[ 2530s]  Thread 0x00007fa69effd700 (most recent call first):
[ 2530s]   File "/home/abuild/rpmbuild/BUILD/Python-3.11.0a1/Lib/threading.py", line 320 in wait
[ 2530s]   File "/home/abuild/rpmbuild/BUILD/Python-3.11.0a1/Lib/multiprocessing/queues.py", line 233 in _feed
[ 2530s]   File "/home/abuild/rpmbuild/BUILD/Python-3.11.0a1/Lib/threading.py", line 968 in run
[ 2530s]   File "/home/abuild/rpmbuild/BUILD/Python-3.11.0a1/Lib/threading.py", line 1031 in _bootstrap_inner
[ 2530s]   File "/home/abuild/rpmbuild/BUILD/Python-3.11.0a1/Lib/threading.py", line 988 in _bootstrap
[ 2530s]
[ 2530s] Thread 0x00007fa6c17fa700 (most recent call first):
[ 2530s]   File "/home/abuild/rpmbuild/BUILD/Python-3.11.0a1/Lib/selectors.py", line 416 in select
[ 2530s]   File "/home/abuild/rpmbuild/BUILD/Python-3.11.0a1/Lib/multiprocessing/connection.py", line 936 in wait
[ 2530s]   File "/home/abuild/rpmbuild/BUILD/Python-3.11.0a1/Lib/concurrent/futures/process.py", line 376 in wait_result_broken_or_wakeup
[ 2530s]   File "/home/abuild/rpmbuild/BUILD/Python-3.11.0a1/Lib/concurrent/futures/process.py", line 316 in run
[ 2530s]   File "/home/abuild/rpmbuild/BUILD/Python-3.11.0a1/Lib/threading.py", line 1031 in _bootstrap_inner
[ 2530s]   File "/home/abuild/rpmbuild/BUILD/Python-3.11.0a1/Lib/threading.py", line 988 in _bootstrap
[ 2530s]
[ 2530s] Current thread 0x00007fa6e90e5740 (most recent call first):
[ 2530s]   File "/home/abuild/rpmbuild/BUILD/Python-3.11.0a1/Lib/test/test_concurrent_futures.py", line 1125 in _fail_on_deadlock
[ 2530s]   File "/home/abuild/rpmbuild/BUILD/Python-3.11.0a1/Lib/test/test_concurrent_futures.py", line 1157 in _check_crash
[ 2530s]   File "/home/abuild/rpmbuild/BUILD/Python-3.11.0a1/Lib/test/test_concurrent_futures.py", line 1175 in test_crash_at_task_unpickle
[ 2530s]   File "/home/abuild/rpmbuild/BUILD/Python-3.11.0a1/Lib/unittest/case.py", line 547 in _callTestMethod
[ 2530s]   File "/home/abuild/rpmbuild/BUILD/Python-3.11.0a1/Lib/unittest/case.py", line 591 in run
[ 2530s]   File "/home/abuild/rpmbuild/BUILD/Python-3.11.0a1/Lib/unittest/case.py", line 646 in __call__
[ 2530s]   File "/home/abuild/rpmbuild/BUILD/Python-3.11.0a1/Lib/unittest/suite.py", line 122 in run
[ 2530s]   File "/home/abuild/rpmbuild/BUILD/Python-3.11.0a1/Lib/unittest/suite.py", line 84 in __call__
[ 2530s]   File "/home/abuild/rpmbuild/BUILD/Python-3.11.0a1/Lib/unittest/suite.py", line 122 in run
[ 2530s]   File "/home/abuild/rpmbuild/BUILD/Python-3.11.0a1/Lib/unittest/suite.py", line 84 in __call__
[ 2530s]   File "/home/abuild/rpmbuild/BUILD/Python-3.11.0a1/Lib/unittest/suite.py", line 122 in run
[ 2530s]   File "/home/abuild/rpmbuild/BUILD/Python-3.11.0a1/Lib/unittest/suite.py", line 84 in __call__
[ 2530s]   File "/home/abuild/rpmbuild/BUILD/Python-3.11.0a1/Lib/unittest/runner.py", line 197 in run
[ 2530s]   File "/home/abuild/rpmbuild/BUILD/Python-3.11.0a1/Lib/test/support/__init__.py", line 992 in _run_suite
[ 2530s]   File "/home/abuild/rpmbuild/BUILD/Python-3.11.0a1/Lib/test/support/__init__.py", line 1118 in run_unittest
[ 2530s]   File "/home/abuild/rpmbuild/BUILD/Python-3.11.0a1/Lib/test/libregrtest/runtest.py", line 261 in _test_module
[ 2530s]   File "/home/abuild/rpmbuild/BUILD/Python-3.11.0a1/Lib/test/libregrtest/runtest.py", line 297 in _runtest_inner2
[ 2530s]   File "/home/abuild/rpmbuild/BUILD/Python-3.11.0a1/Lib/test/libregrtest/runtest.py", line 340 in _runtest_inner
[ 2530s]   File "/home/abuild/rpmbuild/BUILD/Python-3.11.0a1/Lib/test/libregrtest/runtest.py", line 215 in _runtest
[ 2530s]   File "/home/abuild/rpmbuild/BUILD/Python-3.11.0a1/Lib/test/libregrtest/runtest.py", line 245 in runtest
[ 2530s]   File "/home/abuild/rpmbuild/BUILD/Python-3.11.0a1/Lib/test/libregrtest/main.py", line 337 in rerun_failed_tests
[ 2530s]   File "/home/abuild/rpmbuild/BUILD/Python-3.11.0a1/Lib/test/libregrtest/main.py", line 715 in _main
[ 2530s]   File "/home/abuild/rpmbuild/BUILD/Python-3.11.0a1/Lib/test/libregrtest/main.py", line 658 in main
[ 2530s]   File "/home/abuild/rpmbuild/BUILD/Python-3.11.0a1/Lib/test/libregrtest/main.py", line 736 in main
[ 2530s]   File "/home/abuild/rpmbuild/BUILD/Python-3.11.0a1/Lib/test/regrtest.py", line 43 in _main
[ 2530s]   File "/home/abuild/rpmbuild/BUILD/Python-3.11.0a1/Lib/test/regrtest.py", line 47 in <module>
[ 2530s]   File "/home/abuild/rpmbuild/BUILD/Python-3.11.0a1/Lib/runpy.py", line 86 in _run_code
[ 2530s]   File "/home/abuild/rpmbuild/BUILD/Python-3.11.0a1/Lib/runpy.py", line 196 in _run_module_as_main
[ 2530s]
[ 2530s] FAIL
[ 2610s] 77.23s test_crash_during_func_exec_on_worker (test.test_concurrent_futures.ProcessPoolSpawnExecutorDeadlockTest) ...
[ 2610s] Traceback:
[ 2610s]  Thread 0x00007fa69effd700 (most recent call first):
[ 2610s]   File "/home/abuild/rpmbuild/BUILD/Python-3.11.0a1/Lib/threading.py", line 320 in wait
[ 2610s]   File "/home/abuild/rpmbuild/BUILD/Python-3.11.0a1/Lib/multiprocessing/queues.py", line 233 in _feed
[ 2610s]   File "/home/abuild/rpmbuild/BUILD/Python-3.11.0a1/Lib/threading.py", line 968 in run
[ 2610s]   File "/home/abuild/rpmbuild/BUILD/Python-3.11.0a1/Lib/threading.py", line 1031 in _bootstrap_inner
[ 2610s]   File "/home/abuild/rpmbuild/BUILD/Python-3.11.0a1/Lib/threading.py", line 988 in _bootstrap
[ 2610s]
[ 2610s] Thread 0x00007fa6c17fa700 (most recent call first):
[ 2610s]   File "/home/abuild/rpmbuild/BUILD/Python-3.11.0a1/Lib/selectors.py", line 416 in select
[ 2610s]   File "/home/abuild/rpmbuild/BUILD/Python-3.11.0a1/Lib/multiprocessing/connection.py", line 936 in wait
[ 2610s]   File "/home/abuild/rpmbuild/BUILD/Python-3.11.0a1/Lib/concurrent/futures/process.py", line 376 in wait_result_broken_or_wakeup
[ 2610s]   File "/home/abuild/rpmbuild/BUILD/Python-3.11.0a1/Lib/concurrent/futures/process.py", line 316 in run
[ 2610s]   File "/home/abuild/rpmbuild/BUILD/Python-3.11.0a1/Lib/threading.py", line 1031 in _bootstrap_inner
[ 2610s]   File "/home/abuild/rpmbuild/BUILD/Python-3.11.0a1/Lib/threading.py", line 988 in _bootstrap
[ 2610s]
[ 2610s] Current thread 0x00007fa6e90e5740 (most recent call first):
[ 2610s]   File "/home/abuild/rpmbuild/BUILD/Python-3.11.0a1/Lib/test/test_concurrent_futures.py", line 1125 in _fail_on_deadlock
[ 2610s]   File "/home/abuild/rpmbuild/BUILD/Python-3.11.0a1/Lib/test/test_concurrent_futures.py", line 1157 in _check_crash
[ 2610s]   File "/home/abuild/rpmbuild/BUILD/Python-3.11.0a1/Lib/test/test_concurrent_futures.py", line 1179 in test_crash_during_func_exec_on_worker
[ 2610s]   File "/home/abuild/rpmbuild/BUILD/Python-3.11.0a1/Lib/unittest/case.py", line 547 in _callTestMethod
[ 2610s]   File "/home/abuild/rpmbuild/BUILD/Python-3.11.0a1/Lib/unittest/case.py", line 591 in run
[ 2610s]   File "/home/abuild/rpmbuild/BUILD/Python-3.11.0a1/Lib/unittest/case.py", line 646 in __call__
[ 2610s]   File "/home/abuild/rpmbuild/BUILD/Python-3.11.0a1/Lib/unittest/suite.py", line 122 in run
[ 2610s]   File "/home/abuild/rpmbuild/BUILD/Python-3.11.0a1/Lib/unittest/suite.py", line 84 in __call__
[ 2610s]   File "/home/abuild/rpmbuild/BUILD/Python-3.11.0a1/Lib/unittest/suite.py", line 122 in run
[ 2610s]   File "/home/abuild/rpmbuild/BUILD/Python-3.11.0a1/Lib/unittest/suite.py", line 84 in __call__
[ 2610s]   File "/home/abuild/rpmbuild/BUILD/Python-3.11.0a1/Lib/unittest/suite.py", line 122 in run
[ 2610s]   File "/home/abuild/rpmbuild/BUILD/Python-3.11.0a1/Lib/unittest/suite.py", line 84 in __call__
[ 2610s]   File "/home/abuild/rpmbuild/BUILD/Python-3.11.0a1/Lib/unittest/runner.py", line 197 in run
[ 2610s]   File "/home/abuild/rpmbuild/BUILD/Python-3.11.0a1/Lib/test/support/__init__.py", line 992 in _run_suite
[ 2610s]   File "/home/abuild/rpmbuild/BUILD/Python-3.11.0a1/Lib/test/support/__init__.py", line 1118 in run_unittest
[ 2610s]   File "/home/abuild/rpmbuild/BUILD/Python-3.11.0a1/Lib/test/libregrtest/runtest.py", line 261 in _test_module
[ 2610s]   File "/home/abuild/rpmbuild/BUILD/Python-3.11.0a1/Lib/test/libregrtest/runtest.py", line 297 in _runtest_inner2
[ 2610s]   File "/home/abuild/rpmbuild/BUILD/Python-3.11.0a1/Lib/test/libregrtest/runtest.py", line 340 in _runtest_inner
[ 2610s]   File "/home/abuild/rpmbuild/BUILD/Python-3.11.0a1/Lib/test/libregrtest/runtest.py", line 215 in _runtest
[ 2610s]   File "/home/abuild/rpmbuild/BUILD/Python-3.11.0a1/Lib/test/libregrtest/runtest.py", line 245 in runtest
[ 2610s]   File "/home/abuild/rpmbuild/BUILD/Python-3.11.0a1/Lib/test/libregrtest/main.py", line 337 in rerun_failed_tests
[ 2610s]   File "/home/abuild/rpmbuild/BUILD/Python-3.11.0a1/Lib/test/libregrtest/main.py", line 715 in _main
[ 2610s]   File "/home/abuild/rpmbuild/BUILD/Python-3.11.0a1/Lib/test/libregrtest/main.py", line 658 in main
[ 2610s]   File "/home/abuild/rpmbuild/BUILD/Python-3.11.0a1/Lib/test/libregrtest/main.py", line 736 in main
[ 2610s]   File "/home/abuild/rpmbuild/BUILD/Python-3.11.0a1/Lib/test/regrtest.py", line 43 in _main
[ 2610s]   File "/home/abuild/rpmbuild/BUILD/Python-3.11.0a1/Lib/test/regrtest.py", line 47 in <module>
[ 2610s]   File "/home/abuild/rpmbuild/BUILD/Python-3.11.0a1/Lib/runpy.py", line 86 in _run_code
[ 2610s]   File "/home/abuild/rpmbuild/BUILD/Python-3.11.0a1/Lib/runpy.py", line 196 in _run_module_as_main
[ 2610s]
[ 2610s] FAIL
[ 2690s] 80.46s test_crash_during_result_pickle_on_worker (test.test_concurrent_futures.ProcessPoolSpawnExecutorDeadlockTest) ...
[ 2690s] Traceback:
[ 2690s]  Thread 0x00007fa69effd700 (most recent call first):
[ 2690s]   File "/home/abuild/rpmbuild/BUILD/Python-3.11.0a1/Lib/threading.py", line 320 in wait
[ 2690s]   File "/home/abuild/rpmbuild/BUILD/Python-3.11.0a1/Lib/multiprocessing/queues.py", line 233 in _feed
[ 2690s]   File "/home/abuild/rpmbuild/BUILD/Python-3.11.0a1/Lib/threading.py", line 968 in run
[ 2690s]   File "/home/abuild/rpmbuild/BUILD/Python-3.11.0a1/Lib/threading.py", line 1031 in _bootstrap_inner
[ 2690s]   File "/home/abuild/rpmbuild/BUILD/Python-3.11.0a1/Lib/threading.py", line 988 in _bootstrap
[ 2690s]
[ 2690s] Thread 0x00007fa6c17fa700 (most recent call first):
[ 2690s]   File "/home/abuild/rpmbuild/BUILD/Python-3.11.0a1/Lib/selectors.py", line 416 in select
[ 2690s]   File "/home/abuild/rpmbuild/BUILD/Python-3.11.0a1/Lib/multiprocessing/connection.py", line 936 in wait
[ 2690s]   File "/home/abuild/rpmbuild/BUILD/Python-3.11.0a1/Lib/concurrent/futures/process.py", line 376 in wait_result_broken_or_wakeup
[ 2690s]   File "/home/abuild/rpmbuild/BUILD/Python-3.11.0a1/Lib/concurrent/futures/process.py", line 316 in run
[ 2690s]   File "/home/abuild/rpmbuild/BUILD/Python-3.11.0a1/Lib/threading.py", line 1031 in _bootstrap_inner
[ 2690s]   File "/home/abuild/rpmbuild/BUILD/Python-3.11.0a1/Lib/threading.py", line 988 in _bootstrap
[ 2690s]
[ 2690s] Current thread 0x00007fa6e90e5740 (most recent call first):
[ 2690s]   File "/home/abuild/rpmbuild/BUILD/Python-3.11.0a1/Lib/test/test_concurrent_futures.py", line 1125 in _fail_on_deadlock
[ 2690s]   File "/home/abuild/rpmbuild/BUILD/Python-3.11.0a1/Lib/test/test_concurrent_futures.py", line 1157 in _check_crash
[ 2690s]   File "/home/abuild/rpmbuild/BUILD/Python-3.11.0a1/Lib/test/test_concurrent_futures.py", line 1192 in test_crash_during_result_pickle_on_worker
[ 2690s]   File "/home/abuild/rpmbuild/BUILD/Python-3.11.0a1/Lib/unittest/case.py", line 547 in _callTestMethod
[ 2690s]   File "/home/abuild/rpmbuild/BUILD/Python-3.11.0a1/Lib/unittest/case.py", line 591 in run
[ 2690s]   File "/home/abuild/rpmbuild/BUILD/Python-3.11.0a1/Lib/unittest/case.py", line 646 in __call__
[ 2690s]   File "/home/abuild/rpmbuild/BUILD/Python-3.11.0a1/Lib/unittest/suite.py", line 122 in run
[ 2690s]   File "/home/abuild/rpmbuild/BUILD/Python-3.11.0a1/Lib/unittest/suite.py", line 84 in __call__
[ 2690s]   File "/home/abuild/rpmbuild/BUILD/Python-3.11.0a1/Lib/unittest/suite.py", line 122 in run
[ 2690s]   File "/home/abuild/rpmbuild/BUILD/Python-3.11.0a1/Lib/unittest/suite.py", line 84 in __call__
[ 2690s]   File "/home/abuild/rpmbuild/BUILD/Python-3.11.0a1/Lib/unittest/suite.py", line 122 in run
[ 2690s]   File "/home/abuild/rpmbuild/BUILD/Python-3.11.0a1/Lib/unittest/suite.py", line 84 in __call__
[ 2690s]   File "/home/abuild/rpmbuild/BUILD/Python-3.11.0a1/Lib/unittest/runner.py", line 197 in run
[ 2690s]   File "/home/abuild/rpmbuild/BUILD/Python-3.11.0a1/Lib/test/support/__init__.py", line 992 in _run_suite
[ 2690s]   File "/home/abuild/rpmbuild/BUILD/Python-3.11.0a1/Lib/test/support/__init__.py", line 1118 in run_unittest
[ 2690s]   File "/home/abuild/rpmbuild/BUILD/Python-3.11.0a1/Lib/test/libregrtest/runtest.py", line 261 in _test_module
[ 2690s]   File "/home/abuild/rpmbuild/BUILD/Python-3.11.0a1/Lib/test/libregrtest/runtest.py", line 297 in _runtest_inner2
[ 2690s]   File "/home/abuild/rpmbuild/BUILD/Python-3.11.0a1/Lib/test/libregrtest/runtest.py", line 340 in _runtest_inner
[ 2690s]   File "/home/abuild/rpmbuild/BUILD/Python-3.11.0a1/Lib/test/libregrtest/runtest.py", line 215 in _runtest
[ 2690s]   File "/home/abuild/rpmbuild/BUILD/Python-3.11.0a1/Lib/test/libregrtest/runtest.py", line 245 in runtest
[ 2690s]   File "/home/abuild/rpmbuild/BUILD/Python-3.11.0a1/Lib/test/libregrtest/main.py", line 337 in rerun_failed_tests
[ 2690s]   File "/home/abuild/rpmbuild/BUILD/Python-3.11.0a1/Lib/test/libregrtest/main.py", line 715 in _main
[ 2690s]   File "/home/abuild/rpmbuild/BUILD/Python-3.11.0a1/Lib/test/libregrtest/main.py", line 658 in main
[ 2690s]   File "/home/abuild/rpmbuild/BUILD/Python-3.11.0a1/Lib/test/libregrtest/main.py", line 736 in main
[ 2690s]   File "/home/abuild/rpmbuild/BUILD/Python-3.11.0a1/Lib/test/regrtest.py", line 43 in _main
[ 2690s]   File "/home/abuild/rpmbuild/BUILD/Python-3.11.0a1/Lib/test/regrtest.py", line 47 in <module>
[ 2690s]   File "/home/abuild/rpmbuild/BUILD/Python-3.11.0a1/Lib/runpy.py", line 86 in _run_code
[ 2690s]   File "/home/abuild/rpmbuild/BUILD/Python-3.11.0a1/Lib/runpy.py", line 196 in _run_module_as_main
[ 2690s]
[ 2690s] FAIL
[ 2690s] 79.42s
[ 2690s] ======================================================================
[ 2690s] FAIL: test_crash_at_task_unpickle (test.test_concurrent_futures.ProcessPoolForkExecutorDeadlockTest)
[ 2690s] ----------------------------------------------------------------------
[ 2690s] Traceback (most recent call last):
[ 2690s]   File "/home/abuild/rpmbuild/BUILD/Python-3.11.0a1/Lib/test/test_concurrent_futures.py", line 1153, in _check_crash
[ 2690s]     res.result(timeout=self.TIMEOUT)
[ 2690s]     ^^^^^^^^^^^^^^^^^^^^^^^^^^^^^^^^
[ 2690s]   File "/home/abuild/rpmbuild/BUILD/Python-3.11.0a1/Lib/concurrent/futures/_base.py", line 447, in result
[ 2690s]     raise TimeoutError()
[ 2690s]     ^^^^^^^^^^^^^^^^^^^^
[ 2690s] concurrent.futures._base.TimeoutError
[ 2690s]
[ 2690s] During handling of the above exception, another exception occurred:
[ 2690s]
[ 2690s] Traceback (most recent call last):
[ 2690s]   File "/home/abuild/rpmbuild/BUILD/Python-3.11.0a1/Lib/test/test_concurrent_futures.py", line 1175, in test_crash_at_task_unpickle
[ 2690s]     self._check_crash(BrokenProcessPool, id, CrashAtUnpickle())
[ 2690s]     ^^^^^^^^^^^^^^^^^^^^^^^^^^^^^^^^^^^^^^^^^^^^^^^^^^^^^^^^^^^
[ 2690s]   File "/home/abuild/rpmbuild/BUILD/Python-3.11.0a1/Lib/test/test_concurrent_futures.py", line 1157, in _check_crash
[ 2690s]     self._fail_on_deadlock(executor)
[ 2690s]     ^^^^^^^^^^^^^^^^^^^^^^^^^^^^^^^^
[ 2690s]   File "/home/abuild/rpmbuild/BUILD/Python-3.11.0a1/Lib/test/test_concurrent_futures.py", line 1134, in _fail_on_deadlock
[ 2690s]     self.fail(f"Executor deadlock:\n\n{tb}")
[ 2690s]     ^^^^^^^^^^^^^^^^^^^^^^^^^^^^^^^^^^^^^^^^
[ 2690s] AssertionError: Executor deadlock:
[ 2690s]
[ 2690s] Thread 0x00007fa69effd700 (most recent call first):
[ 2690s]   File "/home/abuild/rpmbuild/BUILD/Python-3.11.0a1/Lib/threading.py", line 320 in wait
[ 2690s]   File "/home/abuild/rpmbuild/BUILD/Python-3.11.0a1/Lib/multiprocessing/queues.py", line 233 in _feed
[ 2690s]   File "/home/abuild/rpmbuild/BUILD/Python-3.11.0a1/Lib/threading.py", line 968 in run
[ 2690s]   File "/home/abuild/rpmbuild/BUILD/Python-3.11.0a1/Lib/threading.py", line 1031 in _bootstrap_inner
[ 2690s]   File "/home/abuild/rpmbuild/BUILD/Python-3.11.0a1/Lib/threading.py", line 988 in _bootstrap
[ 2690s]
[ 2690s] Thread 0x00007fa6c17fa700 (most recent call first):
[ 2690s]   File "/home/abuild/rpmbuild/BUILD/Python-3.11.0a1/Lib/selectors.py", line 416 in select
[ 2690s]   File "/home/abuild/rpmbuild/BUILD/Python-3.11.0a1/Lib/multiprocessing/connection.py", line 936 in wait
[ 2690s]   File "/home/abuild/rpmbuild/BUILD/Python-3.11.0a1/Lib/concurrent/futures/process.py", line 376 in wait_result_broken_or_wakeup
[ 2690s]   File "/home/abuild/rpmbuild/BUILD/Python-3.11.0a1/Lib/concurrent/futures/process.py", line 316 in run
[ 2690s]   File "/home/abuild/rpmbuild/BUILD/Python-3.11.0a1/Lib/threading.py", line 1031 in _bootstrap_inner
[ 2690s]   File "/home/abuild/rpmbuild/BUILD/Python-3.11.0a1/Lib/threading.py", line 988 in _bootstrap
[ 2690s]
[ 2690s] Current thread 0x00007fa6e90e5740 (most recent call first):
[ 2690s]   File "/home/abuild/rpmbuild/BUILD/Python-3.11.0a1/Lib/test/test_concurrent_futures.py", line 1125 in _fail_on_deadlock
[ 2690s]   File "/home/abuild/rpmbuild/BUILD/Python-3.11.0a1/Lib/test/test_concurrent_futures.py", line 1157 in _check_crash
[ 2690s]   File "/home/abuild/rpmbuild/BUILD/Python-3.11.0a1/Lib/test/test_concurrent_futures.py", line 1175 in test_crash_at_task_unpickle
[ 2690s]   File "/home/abuild/rpmbuild/BUILD/Python-3.11.0a1/Lib/unittest/case.py", line 547 in _callTestMethod
[ 2690s]   File "/home/abuild/rpmbuild/BUILD/Python-3.11.0a1/Lib/unittest/case.py", line 591 in run
[ 2690s]   File "/home/abuild/rpmbuild/BUILD/Python-3.11.0a1/Lib/unittest/case.py", line 646 in __call__
[ 2690s]   File "/home/abuild/rpmbuild/BUILD/Python-3.11.0a1/Lib/unittest/suite.py", line 122 in run
[ 2690s]   File "/home/abuild/rpmbuild/BUILD/Python-3.11.0a1/Lib/unittest/suite.py", line 84 in __call__
[ 2690s]   File "/home/abuild/rpmbuild/BUILD/Python-3.11.0a1/Lib/unittest/suite.py", line 122 in run
[ 2690s]   File "/home/abuild/rpmbuild/BUILD/Python-3.11.0a1/Lib/unittest/suite.py", line 84 in __call__
[ 2690s]   File "/home/abuild/rpmbuild/BUILD/Python-3.11.0a1/Lib/unittest/suite.py", line 122 in run
[ 2690s]   File "/home/abuild/rpmbuild/BUILD/Python-3.11.0a1/Lib/unittest/suite.py", line 84 in __call__
[ 2690s]   File "/home/abuild/rpmbuild/BUILD/Python-3.11.0a1/Lib/unittest/runner.py", line 197 in run
[ 2690s]   File "/home/abuild/rpmbuild/BUILD/Python-3.11.0a1/Lib/test/support/__init__.py", line 992 in _run_suite
[ 2690s]   File "/home/abuild/rpmbuild/BUILD/Python-3.11.0a1/Lib/test/support/__init__.py", line 1118 in run_unittest
[ 2690s]   File "/home/abuild/rpmbuild/BUILD/Python-3.11.0a1/Lib/test/libregrtest/runtest.py", line 261 in _test_module
[ 2690s]   File "/home/abuild/rpmbuild/BUILD/Python-3.11.0a1/Lib/test/libregrtest/runtest.py", line 297 in _runtest_inner2
[ 2690s]   File "/home/abuild/rpmbuild/BUILD/Python-3.11.0a1/Lib/test/libregrtest/runtest.py", line 340 in _runtest_inner
[ 2690s]   File "/home/abuild/rpmbuild/BUILD/Python-3.11.0a1/Lib/test/libregrtest/runtest.py", line 215 in _runtest
[ 2690s]   File "/home/abuild/rpmbuild/BUILD/Python-3.11.0a1/Lib/test/libregrtest/runtest.py", line 245 in runtest
[ 2690s]   File "/home/abuild/rpmbuild/BUILD/Python-3.11.0a1/Lib/test/libregrtest/main.py", line 337 in rerun_failed_tests
[ 2690s]   File "/home/abuild/rpmbuild/BUILD/Python-3.11.0a1/Lib/test/libregrtest/main.py", line 715 in _main
[ 2690s]   File "/home/abuild/rpmbuild/BUILD/Python-3.11.0a1/Lib/test/libregrtest/main.py", line 658 in main
[ 2690s]   File "/home/abuild/rpmbuild/BUILD/Python-3.11.0a1/Lib/test/libregrtest/main.py", line 736 in main
[ 2690s]   File "/home/abuild/rpmbuild/BUILD/Python-3.11.0a1/Lib/test/regrtest.py", line 43 in _main
[ 2690s]   File "/home/abuild/rpmbuild/BUILD/Python-3.11.0a1/Lib/test/regrtest.py", line 47 in <module>
[ 2690s]   File "/home/abuild/rpmbuild/BUILD/Python-3.11.0a1/Lib/runpy.py", line 86 in _run_code
[ 2690s]   File "/home/abuild/rpmbuild/BUILD/Python-3.11.0a1/Lib/runpy.py", line 196 in _run_module_as_main
[ 2690s]
[ 2690s]
[ 2690s] ======================================================================
[ 2690s] FAIL: test_crash_during_func_exec_on_worker (test.test_concurrent_futures.ProcessPoolForkExecutorDeadlockTest)
[ 2690s] ----------------------------------------------------------------------
[ 2690s] Traceback (most recent call last):
[ 2690s]   File "/home/abuild/rpmbuild/BUILD/Python-3.11.0a1/Lib/test/test_concurrent_futures.py", line 1153, in _check_crash
[ 2690s]     res.result(timeout=self.TIMEOUT)
[ 2690s]     ^^^^^^^^^^^^^^^^^^^^^^^^^^^^^^^^
[ 2690s]   File "/home/abuild/rpmbuild/BUILD/Python-3.11.0a1/Lib/concurrent/futures/_base.py", line 447, in result
[ 2690s]     raise TimeoutError()
[ 2690s]     ^^^^^^^^^^^^^^^^^^^^
[ 2690s] concurrent.futures._base.TimeoutError
[ 2690s]
[ 2690s] During handling of the above exception, another exception occurred:
[ 2690s]
[ 2690s] Traceback (most recent call last):
[ 2690s]   File "/home/abuild/rpmbuild/BUILD/Python-3.11.0a1/Lib/test/test_concurrent_futures.py", line 1179, in test_crash_during_func_exec_on_worker
[ 2690s]     self._check_crash(BrokenProcessPool, _crash)
[ 2690s]     ^^^^^^^^^^^^^^^^^^^^^^^^^^^^^^^^^^^^^^^^^^^^
[ 2690s]   File "/home/abuild/rpmbuild/BUILD/Python-3.11.0a1/Lib/test/test_concurrent_futures.py", line 1157, in _check_crash
[ 2690s]     self._fail_on_deadlock(executor)
[ 2690s]     ^^^^^^^^^^^^^^^^^^^^^^^^^^^^^^^^
[ 2690s]   File "/home/abuild/rpmbuild/BUILD/Python-3.11.0a1/Lib/test/test_concurrent_futures.py", line 1134, in _fail_on_deadlock
[ 2690s]     self.fail(f"Executor deadlock:\n\n{tb}")
[ 2690s]     ^^^^^^^^^^^^^^^^^^^^^^^^^^^^^^^^^^^^^^^^
[ 2690s] AssertionError: Executor deadlock:
[ 2690s]
[ 2690s] Thread 0x00007fa69effd700 (most recent call first):
[ 2690s]   File "/home/abuild/rpmbuild/BUILD/Python-3.11.0a1/Lib/threading.py", line 320 in wait
[ 2690s]   File "/home/abuild/rpmbuild/BUILD/Python-3.11.0a1/Lib/multiprocessing/queues.py", line 233 in _feed
[ 2690s]   File "/home/abuild/rpmbuild/BUILD/Python-3.11.0a1/Lib/threading.py", line 968 in run
[ 2690s]   File "/home/abuild/rpmbuild/BUILD/Python-3.11.0a1/Lib/threading.py", line 1031 in _bootstrap_inner
[ 2690s]   File "/home/abuild/rpmbuild/BUILD/Python-3.11.0a1/Lib/threading.py", line 988 in _bootstrap
[ 2690s]
[ 2690s] Thread 0x00007fa6c17fa700 (most recent call first):
[ 2690s]   File "/home/abuild/rpmbuild/BUILD/Python-3.11.0a1/Lib/selectors.py", line 416 in select
[ 2690s]   File "/home/abuild/rpmbuild/BUILD/Python-3.11.0a1/Lib/multiprocessing/connection.py", line 936 in wait
[ 2690s]   File "/home/abuild/rpmbuild/BUILD/Python-3.11.0a1/Lib/concurrent/futures/process.py", line 376 in wait_result_broken_or_wakeup
[ 2690s]   File "/home/abuild/rpmbuild/BUILD/Python-3.11.0a1/Lib/concurrent/futures/process.py", line 316 in run
[ 2690s]   File "/home/abuild/rpmbuild/BUILD/Python-3.11.0a1/Lib/threading.py", line 1031 in _bootstrap_inner
[ 2690s]   File "/home/abuild/rpmbuild/BUILD/Python-3.11.0a1/Lib/threading.py", line 988 in _bootstrap
[ 2690s]
[ 2690s] Current thread 0x00007fa6e90e5740 (most recent call first):
[ 2690s]   File "/home/abuild/rpmbuild/BUILD/Python-3.11.0a1/Lib/test/test_concurrent_futures.py", line 1125 in _fail_on_deadlock
[ 2690s]   File "/home/abuild/rpmbuild/BUILD/Python-3.11.0a1/Lib/test/test_concurrent_futures.py", line 1157 in _check_crash
[ 2690s]   File "/home/abuild/rpmbuild/BUILD/Python-3.11.0a1/Lib/test/test_concurrent_futures.py", line 1179 in test_crash_during_func_exec_on_worker
[ 2690s]   File "/home/abuild/rpmbuild/BUILD/Python-3.11.0a1/Lib/unittest/case.py", line 547 in _callTestMethod
[ 2690s]   File "/home/abuild/rpmbuild/BUILD/Python-3.11.0a1/Lib/unittest/case.py", line 591 in run
[ 2690s]   File "/home/abuild/rpmbuild/BUILD/Python-3.11.0a1/Lib/unittest/case.py", line 646 in __call__
[ 2690s]   File "/home/abuild/rpmbuild/BUILD/Python-3.11.0a1/Lib/unittest/suite.py", line 122 in run
[ 2690s]   File "/home/abuild/rpmbuild/BUILD/Python-3.11.0a1/Lib/unittest/suite.py", line 84 in __call__
[ 2690s]   File "/home/abuild/rpmbuild/BUILD/Python-3.11.0a1/Lib/unittest/suite.py", line 122 in run
[ 2690s]   File "/home/abuild/rpmbuild/BUILD/Python-3.11.0a1/Lib/unittest/suite.py", line 84 in __call__
[ 2690s]   File "/home/abuild/rpmbuild/BUILD/Python-3.11.0a1/Lib/unittest/suite.py", line 122 in run
[ 2690s]   File "/home/abuild/rpmbuild/BUILD/Python-3.11.0a1/Lib/unittest/suite.py", line 84 in __call__
[ 2690s]   File "/home/abuild/rpmbuild/BUILD/Python-3.11.0a1/Lib/unittest/runner.py", line 197 in run
[ 2690s]   File "/home/abuild/rpmbuild/BUILD/Python-3.11.0a1/Lib/test/support/__init__.py", line 992 in _run_suite
[ 2690s]   File "/home/abuild/rpmbuild/BUILD/Python-3.11.0a1/Lib/test/support/__init__.py", line 1118 in run_unittest
[ 2690s]   File "/home/abuild/rpmbuild/BUILD/Python-3.11.0a1/Lib/test/libregrtest/runtest.py", line 261 in _test_module
[ 2690s]   File "/home/abuild/rpmbuild/BUILD/Python-3.11.0a1/Lib/test/libregrtest/runtest.py", line 297 in _runtest_inner2
[ 2690s]   File "/home/abuild/rpmbuild/BUILD/Python-3.11.0a1/Lib/test/libregrtest/runtest.py", line 340 in _runtest_inner
[ 2690s]   File "/home/abuild/rpmbuild/BUILD/Python-3.11.0a1/Lib/test/libregrtest/runtest.py", line 215 in _runtest
[ 2690s]   File "/home/abuild/rpmbuild/BUILD/Python-3.11.0a1/Lib/test/libregrtest/runtest.py", line 245 in runtest
[ 2690s]   File "/home/abuild/rpmbuild/BUILD/Python-3.11.0a1/Lib/test/libregrtest/main.py", line 337 in rerun_failed_tests
[ 2690s]   File "/home/abuild/rpmbuild/BUILD/Python-3.11.0a1/Lib/test/libregrtest/main.py", line 715 in _main
[ 2690s]   File "/home/abuild/rpmbuild/BUILD/Python-3.11.0a1/Lib/test/libregrtest/main.py", line 658 in main
[ 2690s]   File "/home/abuild/rpmbuild/BUILD/Python-3.11.0a1/Lib/test/libregrtest/main.py", line 736 in main
[ 2690s]   File "/home/abuild/rpmbuild/BUILD/Python-3.11.0a1/Lib/test/regrtest.py", line 43 in _main
[ 2690s]   File "/home/abuild/rpmbuild/BUILD/Python-3.11.0a1/Lib/test/regrtest.py", line 47 in <module>
[ 2690s]   File "/home/abuild/rpmbuild/BUILD/Python-3.11.0a1/Lib/runpy.py", line 86 in _run_code
[ 2690s]   File "/home/abuild/rpmbuild/BUILD/Python-3.11.0a1/Lib/runpy.py", line 196 in _run_module_as_main
[ 2690s]
[ 2690s]
[ 2690s] ======================================================================
[ 2690s] FAIL: test_crash_during_result_pickle_on_worker (test.test_concurrent_futures.ProcessPoolForkExecutorDeadlockTest)
[ 2690s] ----------------------------------------------------------------------
[ 2690s] Traceback (most recent call last):
[ 2690s]   File "/home/abuild/rpmbuild/BUILD/Python-3.11.0a1/Lib/test/test_concurrent_futures.py", line 1153, in _check_crash
[ 2690s]     res.result(timeout=self.TIMEOUT)
[ 2690s]     ^^^^^^^^^^^^^^^^^^^^^^^^^^^^^^^^
[ 2690s]   File "/home/abuild/rpmbuild/BUILD/Python-3.11.0a1/Lib/concurrent/futures/_base.py", line 447, in result
[ 2690s]     raise TimeoutError()
[ 2690s]     ^^^^^^^^^^^^^^^^^^^^
[ 2690s] concurrent.futures._base.TimeoutError
[ 2690s]
[ 2690s] During handling of the above exception, another exception occurred:
[ 2690s]
[ 2690s] Traceback (most recent call last):
[ 2690s]   File "/home/abuild/rpmbuild/BUILD/Python-3.11.0a1/Lib/test/test_concurrent_futures.py", line 1192, in test_crash_during_result_pickle_on_worker
[ 2690s]     self._check_crash(BrokenProcessPool, _return_instance, CrashAtPickle)
[ 2690s]     ^^^^^^^^^^^^^^^^^^^^^^^^^^^^^^^^^^^^^^^^^^^^^^^^^^^^^^^^^^^^^^^^^^^^^
[ 2690s]   File "/home/abuild/rpmbuild/BUILD/Python-3.11.0a1/Lib/test/test_concurrent_futures.py", line 1157, in _check_crash
[ 2690s]     self._fail_on_deadlock(executor)
[ 2690s]     ^^^^^^^^^^^^^^^^^^^^^^^^^^^^^^^^
[ 2690s]   File "/home/abuild/rpmbuild/BUILD/Python-3.11.0a1/Lib/test/test_concurrent_futures.py", line 1134, in _fail_on_deadlock
[ 2690s]     self.fail(f"Executor deadlock:\n\n{tb}")
[ 2690s]     ^^^^^^^^^^^^^^^^^^^^^^^^^^^^^^^^^^^^^^^^
[ 2690s] AssertionError: Executor deadlock:
[ 2690s]
[ 2690s] Thread 0x00007fa69effd700 (most recent call first):
[ 2690s]   File "/home/abuild/rpmbuild/BUILD/Python-3.11.0a1/Lib/threading.py", line 320 in wait
[ 2690s]   File "/home/abuild/rpmbuild/BUILD/Python-3.11.0a1/Lib/multiprocessing/queues.py", line 233 in _feed
[ 2690s]   File "/home/abuild/rpmbuild/BUILD/Python-3.11.0a1/Lib/threading.py", line 968 in run
[ 2690s]   File "/home/abuild/rpmbuild/BUILD/Python-3.11.0a1/Lib/threading.py", line 1031 in _bootstrap_inner
[ 2690s]   File "/home/abuild/rpmbuild/BUILD/Python-3.11.0a1/Lib/threading.py", line 988 in _bootstrap
[ 2690s]
[ 2690s] Thread 0x00007fa6c17fa700 (most recent call first):
[ 2690s]   File "/home/abuild/rpmbuild/BUILD/Python-3.11.0a1/Lib/selectors.py", line 416 in select
[ 2690s]   File "/home/abuild/rpmbuild/BUILD/Python-3.11.0a1/Lib/multiprocessing/connection.py", line 936 in wait
[ 2690s]   File "/home/abuild/rpmbuild/BUILD/Python-3.11.0a1/Lib/concurrent/futures/process.py", line 376 in wait_result_broken_or_wakeup
[ 2690s]   File "/home/abuild/rpmbuild/BUILD/Python-3.11.0a1/Lib/concurrent/futures/process.py", line 316 in run
[ 2690s]   File "/home/abuild/rpmbuild/BUILD/Python-3.11.0a1/Lib/threading.py", line 1031 in _bootstrap_inner
[ 2690s]   File "/home/abuild/rpmbuild/BUILD/Python-3.11.0a1/Lib/threading.py", line 988 in _bootstrap
[ 2690s]
[ 2690s] Current thread 0x00007fa6e90e5740 (most recent call first):
[ 2690s]   File "/home/abuild/rpmbuild/BUILD/Python-3.11.0a1/Lib/test/test_concurrent_futures.py", line 1125 in _fail_on_deadlock
[ 2690s]   File "/home/abuild/rpmbuild/BUILD/Python-3.11.0a1/Lib/test/test_concurrent_futures.py", line 1157 in _check_crash
[ 2690s]   File "/home/abuild/rpmbuild/BUILD/Python-3.11.0a1/Lib/test/test_concurrent_futures.py", line 1192 in test_crash_during_result_pickle_on_worker
[ 2690s]   File "/home/abuild/rpmbuild/BUILD/Python-3.11.0a1/Lib/unittest/case.py", line 547 in _callTestMethod
[ 2690s]   File "/home/abuild/rpmbuild/BUILD/Python-3.11.0a1/Lib/unittest/case.py", line 591 in run
[ 2690s]   File "/home/abuild/rpmbuild/BUILD/Python-3.11.0a1/Lib/unittest/case.py", line 646 in __call__
[ 2690s]   File "/home/abuild/rpmbuild/BUILD/Python-3.11.0a1/Lib/unittest/suite.py", line 122 in run
[ 2690s]   File "/home/abuild/rpmbuild/BUILD/Python-3.11.0a1/Lib/unittest/suite.py", line 84 in __call__
[ 2690s]   File "/home/abuild/rpmbuild/BUILD/Python-3.11.0a1/Lib/unittest/suite.py", line 122 in run
[ 2690s]   File "/home/abuild/rpmbuild/BUILD/Python-3.11.0a1/Lib/unittest/suite.py", line 84 in __call__
[ 2690s]   File "/home/abuild/rpmbuild/BUILD/Python-3.11.0a1/Lib/unittest/suite.py", line 122 in run
[ 2690s]   File "/home/abuild/rpmbuild/BUILD/Python-3.11.0a1/Lib/unittest/suite.py", line 84 in __call__
[ 2690s]   File "/home/abuild/rpmbuild/BUILD/Python-3.11.0a1/Lib/unittest/runner.py", line 197 in run
[ 2690s]   File "/home/abuild/rpmbuild/BUILD/Python-3.11.0a1/Lib/test/support/__init__.py", line 992 in _run_suite
[ 2690s]   File "/home/abuild/rpmbuild/BUILD/Python-3.11.0a1/Lib/test/support/__init__.py", line 1118 in run_unittest
[ 2690s]   File "/home/abuild/rpmbuild/BUILD/Python-3.11.0a1/Lib/test/libregrtest/runtest.py", line 261 in _test_module
[ 2690s]   File "/home/abuild/rpmbuild/BUILD/Python-3.11.0a1/Lib/test/libregrtest/runtest.py", line 297 in _runtest_inner2
[ 2690s]   File "/home/abuild/rpmbuild/BUILD/Python-3.11.0a1/Lib/test/libregrtest/runtest.py", line 340 in _runtest_inner
[ 2690s]   File "/home/abuild/rpmbuild/BUILD/Python-3.11.0a1/Lib/test/libregrtest/runtest.py", line 215 in _runtest
[ 2690s]   File "/home/abuild/rpmbuild/BUILD/Python-3.11.0a1/Lib/test/libregrtest/runtest.py", line 245 in runtest
[ 2690s]   File "/home/abuild/rpmbuild/BUILD/Python-3.11.0a1/Lib/test/libregrtest/main.py", line 337 in rerun_failed_tests
[ 2690s]   File "/home/abuild/rpmbuild/BUILD/Python-3.11.0a1/Lib/test/libregrtest/main.py", line 715 in _main
[ 2690s]   File "/home/abuild/rpmbuild/BUILD/Python-3.11.0a1/Lib/test/libregrtest/main.py", line 658 in main
[ 2690s]   File "/home/abuild/rpmbuild/BUILD/Python-3.11.0a1/Lib/test/libregrtest/main.py", line 736 in main
[ 2690s]   File "/home/abuild/rpmbuild/BUILD/Python-3.11.0a1/Lib/test/regrtest.py", line 43 in _main
[ 2690s]   File "/home/abuild/rpmbuild/BUILD/Python-3.11.0a1/Lib/test/regrtest.py", line 47 in <module>
[ 2690s]   File "/home/abuild/rpmbuild/BUILD/Python-3.11.0a1/Lib/runpy.py", line 86 in _run_code
[ 2690s]   File "/home/abuild/rpmbuild/BUILD/Python-3.11.0a1/Lib/runpy.py", line 196 in _run_module_as_main
[ 2690s]
[ 2690s]
[ 2690s] ======================================================================
[ 2690s] FAIL: test_crash_at_task_unpickle (test.test_concurrent_futures.ProcessPoolForkserverExecutorDeadlockTest)
[ 2690s] ----------------------------------------------------------------------
[ 2690s] Traceback (most recent call last):
[ 2690s]   File "/home/abuild/rpmbuild/BUILD/Python-3.11.0a1/Lib/test/test_concurrent_futures.py", line 1153, in _check_crash
[ 2690s]     res.result(timeout=self.TIMEOUT)
[ 2690s]     ^^^^^^^^^^^^^^^^^^^^^^^^^^^^^^^^
[ 2690s]   File "/home/abuild/rpmbuild/BUILD/Python-3.11.0a1/Lib/concurrent/futures/_base.py", line 447, in result
[ 2690s]     raise TimeoutError()
[ 2690s]     ^^^^^^^^^^^^^^^^^^^^
[ 2690s] concurrent.futures._base.TimeoutError
[ 2690s]
[ 2690s] During handling of the above exception, another exception occurred:
[ 2690s]
[ 2690s] Traceback (most recent call last):
[ 2690s]   File "/home/abuild/rpmbuild/BUILD/Python-3.11.0a1/Lib/test/test_concurrent_futures.py", line 1175, in test_crash_at_task_unpickle
[ 2690s]     self._check_crash(BrokenProcessPool, id, CrashAtUnpickle())
[ 2690s]     ^^^^^^^^^^^^^^^^^^^^^^^^^^^^^^^^^^^^^^^^^^^^^^^^^^^^^^^^^^^
[ 2690s]   File "/home/abuild/rpmbuild/BUILD/Python-3.11.0a1/Lib/test/test_concurrent_futures.py", line 1157, in _check_crash
[ 2690s]     self._fail_on_deadlock(executor)
[ 2690s]     ^^^^^^^^^^^^^^^^^^^^^^^^^^^^^^^^
[ 2690s]   File "/home/abuild/rpmbuild/BUILD/Python-3.11.0a1/Lib/test/test_concurrent_futures.py", line 1134, in _fail_on_deadlock
[ 2690s]     self.fail(f"Executor deadlock:\n\n{tb}")
[ 2690s]     ^^^^^^^^^^^^^^^^^^^^^^^^^^^^^^^^^^^^^^^^
[ 2690s] AssertionError: Executor deadlock:
[ 2690s]
[ 2690s] Thread 0x00007fa69effd700 (most recent call first):
[ 2690s]   File "/home/abuild/rpmbuild/BUILD/Python-3.11.0a1/Lib/threading.py", line 320 in wait
[ 2690s]   File "/home/abuild/rpmbuild/BUILD/Python-3.11.0a1/Lib/multiprocessing/queues.py", line 233 in _feed
[ 2690s]   File "/home/abuild/rpmbuild/BUILD/Python-3.11.0a1/Lib/threading.py", line 968 in run
[ 2690s]   File "/home/abuild/rpmbuild/BUILD/Python-3.11.0a1/Lib/threading.py", line 1031 in _bootstrap_inner
[ 2690s]   File "/home/abuild/rpmbuild/BUILD/Python-3.11.0a1/Lib/threading.py", line 988 in _bootstrap
[ 2690s]
[ 2690s] Thread 0x00007fa6c17fa700 (most recent call first):
[ 2690s]   File "/home/abuild/rpmbuild/BUILD/Python-3.11.0a1/Lib/selectors.py", line 416 in select
[ 2690s]   File "/home/abuild/rpmbuild/BUILD/Python-3.11.0a1/Lib/multiprocessing/connection.py", line 936 in wait
[ 2690s]   File "/home/abuild/rpmbuild/BUILD/Python-3.11.0a1/Lib/concurrent/futures/process.py", line 376 in wait_result_broken_or_wakeup
[ 2690s]   File "/home/abuild/rpmbuild/BUILD/Python-3.11.0a1/Lib/concurrent/futures/process.py", line 316 in run
[ 2690s]   File "/home/abuild/rpmbuild/BUILD/Python-3.11.0a1/Lib/threading.py", line 1031 in _bootstrap_inner
[ 2690s]   File "/home/abuild/rpmbuild/BUILD/Python-3.11.0a1/Lib/threading.py", line 988 in _bootstrap
[ 2690s]
[ 2690s] Current thread 0x00007fa6e90e5740 (most recent call first):
[ 2690s]   File "/home/abuild/rpmbuild/BUILD/Python-3.11.0a1/Lib/test/test_concurrent_futures.py", line 1125 in _fail_on_deadlock
[ 2690s]   File "/home/abuild/rpmbuild/BUILD/Python-3.11.0a1/Lib/test/test_concurrent_futures.py", line 1157 in _check_crash
[ 2690s]   File "/home/abuild/rpmbuild/BUILD/Python-3.11.0a1/Lib/test/test_concurrent_futures.py", line 1175 in test_crash_at_task_unpickle
[ 2690s]   File "/home/abuild/rpmbuild/BUILD/Python-3.11.0a1/Lib/unittest/case.py", line 547 in _callTestMethod
[ 2690s]   File "/home/abuild/rpmbuild/BUILD/Python-3.11.0a1/Lib/unittest/case.py", line 591 in run
[ 2690s]   File "/home/abuild/rpmbuild/BUILD/Python-3.11.0a1/Lib/unittest/case.py", line 646 in __call__
[ 2690s]   File "/home/abuild/rpmbuild/BUILD/Python-3.11.0a1/Lib/unittest/suite.py", line 122 in run
[ 2690s]   File "/home/abuild/rpmbuild/BUILD/Python-3.11.0a1/Lib/unittest/suite.py", line 84 in __call__
[ 2690s]   File "/home/abuild/rpmbuild/BUILD/Python-3.11.0a1/Lib/unittest/suite.py", line 122 in run
[ 2690s]   File "/home/abuild/rpmbuild/BUILD/Python-3.11.0a1/Lib/unittest/suite.py", line 84 in __call__
[ 2690s]   File "/home/abuild/rpmbuild/BUILD/Python-3.11.0a1/Lib/unittest/suite.py", line 122 in run
[ 2690s]   File "/home/abuild/rpmbuild/BUILD/Python-3.11.0a1/Lib/unittest/suite.py", line 84 in __call__
[ 2690s]   File "/home/abuild/rpmbuild/BUILD/Python-3.11.0a1/Lib/unittest/runner.py", line 197 in run
[ 2690s]   File "/home/abuild/rpmbuild/BUILD/Python-3.11.0a1/Lib/test/support/__init__.py", line 992 in _run_suite
[ 2690s]   File "/home/abuild/rpmbuild/BUILD/Python-3.11.0a1/Lib/test/support/__init__.py", line 1118 in run_unittest
[ 2690s]   File "/home/abuild/rpmbuild/BUILD/Python-3.11.0a1/Lib/test/libregrtest/runtest.py", line 261 in _test_module
[ 2690s]   File "/home/abuild/rpmbuild/BUILD/Python-3.11.0a1/Lib/test/libregrtest/runtest.py", line 297 in _runtest_inner2
[ 2690s]   File "/home/abuild/rpmbuild/BUILD/Python-3.11.0a1/Lib/test/libregrtest/runtest.py", line 340 in _runtest_inner
[ 2690s]   File "/home/abuild/rpmbuild/BUILD/Python-3.11.0a1/Lib/test/libregrtest/runtest.py", line 215 in _runtest
[ 2690s]   File "/home/abuild/rpmbuild/BUILD/Python-3.11.0a1/Lib/test/libregrtest/runtest.py", line 245 in runtest
[ 2690s]   File "/home/abuild/rpmbuild/BUILD/Python-3.11.0a1/Lib/test/libregrtest/main.py", line 337 in rerun_failed_tests
[ 2690s]   File "/home/abuild/rpmbuild/BUILD/Python-3.11.0a1/Lib/test/libregrtest/main.py", line 715 in _main
[ 2690s]   File "/home/abuild/rpmbuild/BUILD/Python-3.11.0a1/Lib/test/libregrtest/main.py", line 658 in main
[ 2690s]   File "/home/abuild/rpmbuild/BUILD/Python-3.11.0a1/Lib/test/libregrtest/main.py", line 736 in main
[ 2690s]   File "/home/abuild/rpmbuild/BUILD/Python-3.11.0a1/Lib/test/regrtest.py", line 43 in _main
[ 2690s]   File "/home/abuild/rpmbuild/BUILD/Python-3.11.0a1/Lib/test/regrtest.py", line 47 in <module>
[ 2690s]   File "/home/abuild/rpmbuild/BUILD/Python-3.11.0a1/Lib/runpy.py", line 86 in _run_code
[ 2690s]   File "/home/abuild/rpmbuild/BUILD/Python-3.11.0a1/Lib/runpy.py", line 196 in _run_module_as_main
[ 2690s]
[ 2690s]
[ 2690s] ======================================================================
[ 2690s] FAIL: test_crash_during_func_exec_on_worker (test.test_concurrent_futures.ProcessPoolForkserverExecutorDeadlockTest)
[ 2690s] ----------------------------------------------------------------------
[ 2690s] Traceback (most recent call last):
[ 2690s]   File "/home/abuild/rpmbuild/BUILD/Python-3.11.0a1/Lib/test/test_concurrent_futures.py", line 1153, in _check_crash
[ 2690s]     res.result(timeout=self.TIMEOUT)
[ 2690s]     ^^^^^^^^^^^^^^^^^^^^^^^^^^^^^^^^
[ 2690s]   File "/home/abuild/rpmbuild/BUILD/Python-3.11.0a1/Lib/concurrent/futures/_base.py", line 447, in result
[ 2690s]     raise TimeoutError()
[ 2690s]     ^^^^^^^^^^^^^^^^^^^^
[ 2690s] concurrent.futures._base.TimeoutError
[ 2690s]
[ 2690s] During handling of the above exception, another exception occurred:
[ 2690s]
[ 2690s] Traceback (most recent call last):
[ 2690s]   File "/home/abuild/rpmbuild/BUILD/Python-3.11.0a1/Lib/test/test_concurrent_futures.py", line 1179, in test_crash_during_func_exec_on_worker
[ 2690s]     self._check_crash(BrokenProcessPool, _crash)
[ 2690s]     ^^^^^^^^^^^^^^^^^^^^^^^^^^^^^^^^^^^^^^^^^^^^
[ 2690s]   File "/home/abuild/rpmbuild/BUILD/Python-3.11.0a1/Lib/test/test_concurrent_futures.py", line 1157, in _check_crash
[ 2690s]     self._fail_on_deadlock(executor)
[ 2690s]     ^^^^^^^^^^^^^^^^^^^^^^^^^^^^^^^^
[ 2690s]   File "/home/abuild/rpmbuild/BUILD/Python-3.11.0a1/Lib/test/test_concurrent_futures.py", line 1134, in _fail_on_deadlock
[ 2690s]     self.fail(f"Executor deadlock:\n\n{tb}")
[ 2690s]     ^^^^^^^^^^^^^^^^^^^^^^^^^^^^^^^^^^^^^^^^
[ 2690s] AssertionError: Executor deadlock:
[ 2690s]
[ 2690s] Thread 0x00007fa69effd700 (most recent call first):
[ 2690s]   File "/home/abuild/rpmbuild/BUILD/Python-3.11.0a1/Lib/threading.py", line 320 in wait
[ 2690s]   File "/home/abuild/rpmbuild/BUILD/Python-3.11.0a1/Lib/multiprocessing/queues.py", line 233 in _feed
[ 2690s]   File "/home/abuild/rpmbuild/BUILD/Python-3.11.0a1/Lib/threading.py", line 968 in run
[ 2690s]   File "/home/abuild/rpmbuild/BUILD/Python-3.11.0a1/Lib/threading.py", line 1031 in _bootstrap_inner
[ 2690s]   File "/home/abuild/rpmbuild/BUILD/Python-3.11.0a1/Lib/threading.py", line 988 in _bootstrap
[ 2690s]
[ 2690s] Thread 0x00007fa6c17fa700 (most recent call first):
[ 2690s]   File "/home/abuild/rpmbuild/BUILD/Python-3.11.0a1/Lib/selectors.py", line 416 in select
[ 2690s]   File "/home/abuild/rpmbuild/BUILD/Python-3.11.0a1/Lib/multiprocessing/connection.py", line 936 in wait
[ 2690s]   File "/home/abuild/rpmbuild/BUILD/Python-3.11.0a1/Lib/concurrent/futures/process.py", line 376 in wait_result_broken_or_wakeup
[ 2690s]   File "/home/abuild/rpmbuild/BUILD/Python-3.11.0a1/Lib/concurrent/futures/process.py", line 316 in run
[ 2690s]   File "/home/abuild/rpmbuild/BUILD/Python-3.11.0a1/Lib/threading.py", line 1031 in _bootstrap_inner
[ 2690s]   File "/home/abuild/rpmbuild/BUILD/Python-3.11.0a1/Lib/threading.py", line 988 in _bootstrap
[ 2690s]
[ 2690s] Current thread 0x00007fa6e90e5740 (most recent call first):
[ 2690s]   File "/home/abuild/rpmbuild/BUILD/Python-3.11.0a1/Lib/test/test_concurrent_futures.py", line 1125 in _fail_on_deadlock
[ 2690s]   File "/home/abuild/rpmbuild/BUILD/Python-3.11.0a1/Lib/test/test_concurrent_futures.py", line 1157 in _check_crash
[ 2690s]   File "/home/abuild/rpmbuild/BUILD/Python-3.11.0a1/Lib/test/test_concurrent_futures.py", line 1179 in test_crash_during_func_exec_on_worker
[ 2690s]   File "/home/abuild/rpmbuild/BUILD/Python-3.11.0a1/Lib/unittest/case.py", line 547 in _callTestMethod
[ 2690s]   File "/home/abuild/rpmbuild/BUILD/Python-3.11.0a1/Lib/unittest/case.py", line 591 in run
[ 2690s]   File "/home/abuild/rpmbuild/BUILD/Python-3.11.0a1/Lib/unittest/case.py", line 646 in __call__
[ 2690s]   File "/home/abuild/rpmbuild/BUILD/Python-3.11.0a1/Lib/unittest/suite.py", line 122 in run
[ 2690s]   File "/home/abuild/rpmbuild/BUILD/Python-3.11.0a1/Lib/unittest/suite.py", line 84 in __call__
[ 2690s]   File "/home/abuild/rpmbuild/BUILD/Python-3.11.0a1/Lib/unittest/suite.py", line 122 in run
[ 2690s]   File "/home/abuild/rpmbuild/BUILD/Python-3.11.0a1/Lib/unittest/suite.py", line 84 in __call__
[ 2690s]   File "/home/abuild/rpmbuild/BUILD/Python-3.11.0a1/Lib/unittest/suite.py", line 122 in run
[ 2690s]   File "/home/abuild/rpmbuild/BUILD/Python-3.11.0a1/Lib/unittest/suite.py", line 84 in __call__
[ 2690s]   File "/home/abuild/rpmbuild/BUILD/Python-3.11.0a1/Lib/unittest/runner.py", line 197 in run
[ 2690s]   File "/home/abuild/rpmbuild/BUILD/Python-3.11.0a1/Lib/test/support/__init__.py", line 992 in _run_suite
[ 2690s]   File "/home/abuild/rpmbuild/BUILD/Python-3.11.0a1/Lib/test/support/__init__.py", line 1118 in run_unittest
[ 2690s]   File "/home/abuild/rpmbuild/BUILD/Python-3.11.0a1/Lib/test/libregrtest/runtest.py", line 261 in _test_module
[ 2690s]   File "/home/abuild/rpmbuild/BUILD/Python-3.11.0a1/Lib/test/libregrtest/runtest.py", line 297 in _runtest_inner2
[ 2690s]   File "/home/abuild/rpmbuild/BUILD/Python-3.11.0a1/Lib/test/libregrtest/runtest.py", line 340 in _runtest_inner
[ 2690s]   File "/home/abuild/rpmbuild/BUILD/Python-3.11.0a1/Lib/test/libregrtest/runtest.py", line 215 in _runtest
[ 2690s]   File "/home/abuild/rpmbuild/BUILD/Python-3.11.0a1/Lib/test/libregrtest/runtest.py", line 245 in runtest
[ 2690s]   File "/home/abuild/rpmbuild/BUILD/Python-3.11.0a1/Lib/test/libregrtest/main.py", line 337 in rerun_failed_tests
[ 2690s]   File "/home/abuild/rpmbuild/BUILD/Python-3.11.0a1/Lib/test/libregrtest/main.py", line 715 in _main
[ 2690s]   File "/home/abuild/rpmbuild/BUILD/Python-3.11.0a1/Lib/test/libregrtest/main.py", line 658 in main
[ 2690s]   File "/home/abuild/rpmbuild/BUILD/Python-3.11.0a1/Lib/test/libregrtest/main.py", line 736 in main
[ 2690s]   File "/home/abuild/rpmbuild/BUILD/Python-3.11.0a1/Lib/test/regrtest.py", line 43 in _main
[ 2690s]   File "/home/abuild/rpmbuild/BUILD/Python-3.11.0a1/Lib/test/regrtest.py", line 47 in <module>
[ 2690s]   File "/home/abuild/rpmbuild/BUILD/Python-3.11.0a1/Lib/runpy.py", line 86 in _run_code
[ 2690s]   File "/home/abuild/rpmbuild/BUILD/Python-3.11.0a1/Lib/runpy.py", line 196 in _run_module_as_main
[ 2690s]
[ 2690s]
[ 2690s] ======================================================================
[ 2690s] FAIL: test_crash_during_result_pickle_on_worker (test.test_concurrent_futures.ProcessPoolForkserverExecutorDeadlockTest)
[ 2690s] ----------------------------------------------------------------------
[ 2690s] Traceback (most recent call last):
[ 2690s]   File "/home/abuild/rpmbuild/BUILD/Python-3.11.0a1/Lib/test/test_concurrent_futures.py", line 1153, in _check_crash
[ 2690s]     res.result(timeout=self.TIMEOUT)
[ 2690s]     ^^^^^^^^^^^^^^^^^^^^^^^^^^^^^^^^
[ 2690s]   File "/home/abuild/rpmbuild/BUILD/Python-3.11.0a1/Lib/concurrent/futures/_base.py", line 447, in result
[ 2690s]     raise TimeoutError()
[ 2690s]     ^^^^^^^^^^^^^^^^^^^^
[ 2690s] concurrent.futures._base.TimeoutError
[ 2690s]
[ 2690s] During handling of the above exception, another exception occurred:
[ 2690s]
[ 2690s] Traceback (most recent call last):
[ 2690s]   File "/home/abuild/rpmbuild/BUILD/Python-3.11.0a1/Lib/test/test_concurrent_futures.py", line 1192, in test_crash_during_result_pickle_on_worker
[ 2690s]     self._check_crash(BrokenProcessPool, _return_instance, CrashAtPickle)
[ 2690s]     ^^^^^^^^^^^^^^^^^^^^^^^^^^^^^^^^^^^^^^^^^^^^^^^^^^^^^^^^^^^^^^^^^^^^^
[ 2690s]   File "/home/abuild/rpmbuild/BUILD/Python-3.11.0a1/Lib/test/test_concurrent_futures.py", line 1157, in _check_crash
[ 2690s]     self._fail_on_deadlock(executor)
[ 2690s]     ^^^^^^^^^^^^^^^^^^^^^^^^^^^^^^^^
[ 2690s]   File "/home/abuild/rpmbuild/BUILD/Python-3.11.0a1/Lib/test/test_concurrent_futures.py", line 1134, in _fail_on_deadlock
[ 2690s]     self.fail(f"Executor deadlock:\n\n{tb}")
[ 2690s]     ^^^^^^^^^^^^^^^^^^^^^^^^^^^^^^^^^^^^^^^^
[ 2690s] AssertionError: Executor deadlock:
[ 2690s]
[ 2690s] Thread 0x00007fa69effd700 (most recent call first):
[ 2690s]   File "/home/abuild/rpmbuild/BUILD/Python-3.11.0a1/Lib/threading.py", line 320 in wait
[ 2690s]   File "/home/abuild/rpmbuild/BUILD/Python-3.11.0a1/Lib/multiprocessing/queues.py", line 233 in _feed
[ 2690s]   File "/home/abuild/rpmbuild/BUILD/Python-3.11.0a1/Lib/threading.py", line 968 in run
[ 2690s]   File "/home/abuild/rpmbuild/BUILD/Python-3.11.0a1/Lib/threading.py", line 1031 in _bootstrap_inner
[ 2690s]   File "/home/abuild/rpmbuild/BUILD/Python-3.11.0a1/Lib/threading.py", line 988 in _bootstrap
[ 2690s]
[ 2690s] Thread 0x00007fa6c17fa700 (most recent call first):
[ 2690s]   File "/home/abuild/rpmbuild/BUILD/Python-3.11.0a1/Lib/selectors.py", line 416 in select
[ 2690s]   File "/home/abuild/rpmbuild/BUILD/Python-3.11.0a1/Lib/multiprocessing/connection.py", line 936 in wait
[ 2690s]   File "/home/abuild/rpmbuild/BUILD/Python-3.11.0a1/Lib/concurrent/futures/process.py", line 376 in wait_result_broken_or_wakeup
[ 2690s]   File "/home/abuild/rpmbuild/BUILD/Python-3.11.0a1/Lib/concurrent/futures/process.py", line 316 in run
[ 2690s]   File "/home/abuild/rpmbuild/BUILD/Python-3.11.0a1/Lib/threading.py", line 1031 in _bootstrap_inner
[ 2690s]   File "/home/abuild/rpmbuild/BUILD/Python-3.11.0a1/Lib/threading.py", line 988 in _bootstrap
[ 2690s]
[ 2690s] Current thread 0x00007fa6e90e5740 (most recent call first):
[ 2690s]   File "/home/abuild/rpmbuild/BUILD/Python-3.11.0a1/Lib/test/test_concurrent_futures.py", line 1125 in _fail_on_deadlock
[ 2690s]   File "/home/abuild/rpmbuild/BUILD/Python-3.11.0a1/Lib/test/test_concurrent_futures.py", line 1157 in _check_crash
[ 2690s]   File "/home/abuild/rpmbuild/BUILD/Python-3.11.0a1/Lib/test/test_concurrent_futures.py", line 1192 in test_crash_during_result_pickle_on_worker
[ 2690s]   File "/home/abuild/rpmbuild/BUILD/Python-3.11.0a1/Lib/unittest/case.py", line 547 in _callTestMethod
[ 2690s]   File "/home/abuild/rpmbuild/BUILD/Python-3.11.0a1/Lib/unittest/case.py", line 591 in run
[ 2690s]   File "/home/abuild/rpmbuild/BUILD/Python-3.11.0a1/Lib/unittest/case.py", line 646 in __call__
[ 2690s]   File "/home/abuild/rpmbuild/BUILD/Python-3.11.0a1/Lib/unittest/suite.py", line 122 in run
[ 2690s]   File "/home/abuild/rpmbuild/BUILD/Python-3.11.0a1/Lib/unittest/suite.py", line 84 in __call__
[ 2690s]   File "/home/abuild/rpmbuild/BUILD/Python-3.11.0a1/Lib/unittest/suite.py", line 122 in run
[ 2690s]   File "/home/abuild/rpmbuild/BUILD/Python-3.11.0a1/Lib/unittest/suite.py", line 84 in __call__
[ 2690s]   File "/home/abuild/rpmbuild/BUILD/Python-3.11.0a1/Lib/unittest/suite.py", line 122 in run
[ 2690s]   File "/home/abuild/rpmbuild/BUILD/Python-3.11.0a1/Lib/unittest/suite.py", line 84 in __call__
[ 2690s]   File "/home/abuild/rpmbuild/BUILD/Python-3.11.0a1/Lib/unittest/runner.py", line 197 in run
[ 2690s]   File "/home/abuild/rpmbuild/BUILD/Python-3.11.0a1/Lib/test/support/__init__.py", line 992 in _run_suite
[ 2690s]   File "/home/abuild/rpmbuild/BUILD/Python-3.11.0a1/Lib/test/support/__init__.py", line 1118 in run_unittest
[ 2690s]   File "/home/abuild/rpmbuild/BUILD/Python-3.11.0a1/Lib/test/libregrtest/runtest.py", line 261 in _test_module
[ 2690s]   File "/home/abuild/rpmbuild/BUILD/Python-3.11.0a1/Lib/test/libregrtest/runtest.py", line 297 in _runtest_inner2
[ 2690s]   File "/home/abuild/rpmbuild/BUILD/Python-3.11.0a1/Lib/test/libregrtest/runtest.py", line 340 in _runtest_inner
[ 2690s]   File "/home/abuild/rpmbuild/BUILD/Python-3.11.0a1/Lib/test/libregrtest/runtest.py", line 215 in _runtest
[ 2690s]   File "/home/abuild/rpmbuild/BUILD/Python-3.11.0a1/Lib/test/libregrtest/runtest.py", line 245 in runtest
[ 2690s]   File "/home/abuild/rpmbuild/BUILD/Python-3.11.0a1/Lib/test/libregrtest/main.py", line 337 in rerun_failed_tests
[ 2690s]   File "/home/abuild/rpmbuild/BUILD/Python-3.11.0a1/Lib/test/libregrtest/main.py", line 715 in _main
[ 2690s]   File "/home/abuild/rpmbuild/BUILD/Python-3.11.0a1/Lib/test/libregrtest/main.py", line 658 in main
[ 2690s]   File "/home/abuild/rpmbuild/BUILD/Python-3.11.0a1/Lib/test/libregrtest/main.py", line 736 in main
[ 2690s]   File "/home/abuild/rpmbuild/BUILD/Python-3.11.0a1/Lib/test/regrtest.py", line 43 in _main
[ 2690s]   File "/home/abuild/rpmbuild/BUILD/Python-3.11.0a1/Lib/test/regrtest.py", line 47 in <module>
[ 2690s]   File "/home/abuild/rpmbuild/BUILD/Python-3.11.0a1/Lib/runpy.py", line 86 in _run_code
[ 2690s]   File "/home/abuild/rpmbuild/BUILD/Python-3.11.0a1/Lib/runpy.py", line 196 in _run_module_as_main
[ 2690s]
[ 2690s]
[ 2690s] ======================================================================
[ 2690s] FAIL: test_crash_at_task_unpickle (test.test_concurrent_futures.ProcessPoolSpawnExecutorDeadlockTest)
[ 2690s] ----------------------------------------------------------------------
[ 2690s] Traceback (most recent call last):
[ 2690s]   File "/home/abuild/rpmbuild/BUILD/Python-3.11.0a1/Lib/test/test_concurrent_futures.py", line 1153, in _check_crash
[ 2690s]     res.result(timeout=self.TIMEOUT)
[ 2690s]     ^^^^^^^^^^^^^^^^^^^^^^^^^^^^^^^^
[ 2690s]   File "/home/abuild/rpmbuild/BUILD/Python-3.11.0a1/Lib/concurrent/futures/_base.py", line 447, in result
[ 2690s]     raise TimeoutError()
[ 2690s]     ^^^^^^^^^^^^^^^^^^^^
[ 2690s] concurrent.futures._base.TimeoutError
[ 2690s]
[ 2690s] During handling of the above exception, another exception occurred:
[ 2690s]
[ 2690s] Traceback (most recent call last):
[ 2690s]   File "/home/abuild/rpmbuild/BUILD/Python-3.11.0a1/Lib/test/test_concurrent_futures.py", line 1175, in test_crash_at_task_unpickle
[ 2690s]     self._check_crash(BrokenProcessPool, id, CrashAtUnpickle())
[ 2690s]     ^^^^^^^^^^^^^^^^^^^^^^^^^^^^^^^^^^^^^^^^^^^^^^^^^^^^^^^^^^^
[ 2690s]   File "/home/abuild/rpmbuild/BUILD/Python-3.11.0a1/Lib/test/test_concurrent_futures.py", line 1157, in _check_crash
[ 2690s]     self._fail_on_deadlock(executor)
[ 2690s]     ^^^^^^^^^^^^^^^^^^^^^^^^^^^^^^^^
[ 2690s]   File "/home/abuild/rpmbuild/BUILD/Python-3.11.0a1/Lib/test/test_concurrent_futures.py", line 1134, in _fail_on_deadlock
[ 2690s]     self.fail(f"Executor deadlock:\n\n{tb}")
[ 2690s]     ^^^^^^^^^^^^^^^^^^^^^^^^^^^^^^^^^^^^^^^^
[ 2690s] AssertionError: Executor deadlock:
[ 2690s]
[ 2690s] Thread 0x00007fa69effd700 (most recent call first):
[ 2690s]   File "/home/abuild/rpmbuild/BUILD/Python-3.11.0a1/Lib/threading.py", line 320 in wait
[ 2690s]   File "/home/abuild/rpmbuild/BUILD/Python-3.11.0a1/Lib/multiprocessing/queues.py", line 233 in _feed
[ 2690s]   File "/home/abuild/rpmbuild/BUILD/Python-3.11.0a1/Lib/threading.py", line 968 in run
[ 2690s]   File "/home/abuild/rpmbuild/BUILD/Python-3.11.0a1/Lib/threading.py", line 1031 in _bootstrap_inner
[ 2690s]   File "/home/abuild/rpmbuild/BUILD/Python-3.11.0a1/Lib/threading.py", line 988 in _bootstrap
[ 2690s]
[ 2690s] Thread 0x00007fa6c17fa700 (most recent call first):
[ 2690s]   File "/home/abuild/rpmbuild/BUILD/Python-3.11.0a1/Lib/selectors.py", line 416 in select
[ 2690s]   File "/home/abuild/rpmbuild/BUILD/Python-3.11.0a1/Lib/multiprocessing/connection.py", line 936 in wait
[ 2690s]   File "/home/abuild/rpmbuild/BUILD/Python-3.11.0a1/Lib/concurrent/futures/process.py", line 376 in wait_result_broken_or_wakeup
[ 2690s]   File "/home/abuild/rpmbuild/BUILD/Python-3.11.0a1/Lib/concurrent/futures/process.py", line 316 in run
[ 2690s]   File "/home/abuild/rpmbuild/BUILD/Python-3.11.0a1/Lib/threading.py", line 1031 in _bootstrap_inner
[ 2690s]   File "/home/abuild/rpmbuild/BUILD/Python-3.11.0a1/Lib/threading.py", line 988 in _bootstrap
[ 2690s]
[ 2690s] Current thread 0x00007fa6e90e5740 (most recent call first):
[ 2690s]   File "/home/abuild/rpmbuild/BUILD/Python-3.11.0a1/Lib/test/test_concurrent_futures.py", line 1125 in _fail_on_deadlock
[ 2690s]   File "/home/abuild/rpmbuild/BUILD/Python-3.11.0a1/Lib/test/test_concurrent_futures.py", line 1157 in _check_crash
[ 2690s]   File "/home/abuild/rpmbuild/BUILD/Python-3.11.0a1/Lib/test/test_concurrent_futures.py", line 1175 in test_crash_at_task_unpickle
[ 2690s]   File "/home/abuild/rpmbuild/BUILD/Python-3.11.0a1/Lib/unittest/case.py", line 547 in _callTestMethod
[ 2690s]   File "/home/abuild/rpmbuild/BUILD/Python-3.11.0a1/Lib/unittest/case.py", line 591 in run
[ 2690s]   File "/home/abuild/rpmbuild/BUILD/Python-3.11.0a1/Lib/unittest/case.py", line 646 in __call__
[ 2690s]   File "/home/abuild/rpmbuild/BUILD/Python-3.11.0a1/Lib/unittest/suite.py", line 122 in run
[ 2690s]   File "/home/abuild/rpmbuild/BUILD/Python-3.11.0a1/Lib/unittest/suite.py", line 84 in __call__
[ 2690s]   File "/home/abuild/rpmbuild/BUILD/Python-3.11.0a1/Lib/unittest/suite.py", line 122 in run
[ 2690s]   File "/home/abuild/rpmbuild/BUILD/Python-3.11.0a1/Lib/unittest/suite.py", line 84 in __call__
[ 2690s]   File "/home/abuild/rpmbuild/BUILD/Python-3.11.0a1/Lib/unittest/suite.py", line 122 in run
[ 2690s]   File "/home/abuild/rpmbuild/BUILD/Python-3.11.0a1/Lib/unittest/suite.py", line 84 in __call__
[ 2690s]   File "/home/abuild/rpmbuild/BUILD/Python-3.11.0a1/Lib/unittest/runner.py", line 197 in run
[ 2690s]   File "/home/abuild/rpmbuild/BUILD/Python-3.11.0a1/Lib/test/support/__init__.py", line 992 in _run_suite
[ 2690s]   File "/home/abuild/rpmbuild/BUILD/Python-3.11.0a1/Lib/test/support/__init__.py", line 1118 in run_unittest
[ 2690s]   File "/home/abuild/rpmbuild/BUILD/Python-3.11.0a1/Lib/test/libregrtest/runtest.py", line 261 in _test_module
[ 2690s]   File "/home/abuild/rpmbuild/BUILD/Python-3.11.0a1/Lib/test/libregrtest/runtest.py", line 297 in _runtest_inner2
[ 2690s]   File "/home/abuild/rpmbuild/BUILD/Python-3.11.0a1/Lib/test/libregrtest/runtest.py", line 340 in _runtest_inner
[ 2690s]   File "/home/abuild/rpmbuild/BUILD/Python-3.11.0a1/Lib/test/libregrtest/runtest.py", line 215 in _runtest
[ 2690s]   File "/home/abuild/rpmbuild/BUILD/Python-3.11.0a1/Lib/test/libregrtest/runtest.py", line 245 in runtest
[ 2690s]   File "/home/abuild/rpmbuild/BUILD/Python-3.11.0a1/Lib/test/libregrtest/main.py", line 337 in rerun_failed_tests
[ 2690s]   File "/home/abuild/rpmbuild/BUILD/Python-3.11.0a1/Lib/test/libregrtest/main.py", line 715 in _main
[ 2690s]   File "/home/abuild/rpmbuild/BUILD/Python-3.11.0a1/Lib/test/libregrtest/main.py", line 658 in main
[ 2690s]   File "/home/abuild/rpmbuild/BUILD/Python-3.11.0a1/Lib/test/libregrtest/main.py", line 736 in main
[ 2690s]   File "/home/abuild/rpmbuild/BUILD/Python-3.11.0a1/Lib/test/regrtest.py", line 43 in _main
[ 2690s]   File "/home/abuild/rpmbuild/BUILD/Python-3.11.0a1/Lib/test/regrtest.py", line 47 in <module>
[ 2690s]   File "/home/abuild/rpmbuild/BUILD/Python-3.11.0a1/Lib/runpy.py", line 86 in _run_code
[ 2690s]   File "/home/abuild/rpmbuild/BUILD/Python-3.11.0a1/Lib/runpy.py", line 196 in _run_module_as_main
[ 2690s]
[ 2690s]
[ 2690s] ======================================================================
[ 2690s] FAIL: test_crash_during_func_exec_on_worker (test.test_concurrent_futures.ProcessPoolSpawnExecutorDeadlockTest)
[ 2690s] ----------------------------------------------------------------------
[ 2690s] Traceback (most recent call last):
[ 2690s]   File "/home/abuild/rpmbuild/BUILD/Python-3.11.0a1/Lib/test/test_concurrent_futures.py", line 1153, in _check_crash
[ 2690s]     res.result(timeout=self.TIMEOUT)
[ 2690s]     ^^^^^^^^^^^^^^^^^^^^^^^^^^^^^^^^
[ 2690s]   File "/home/abuild/rpmbuild/BUILD/Python-3.11.0a1/Lib/concurrent/futures/_base.py", line 447, in result
[ 2690s]     raise TimeoutError()
[ 2690s]     ^^^^^^^^^^^^^^^^^^^^
[ 2690s] concurrent.futures._base.TimeoutError
[ 2690s]
[ 2690s] During handling of the above exception, another exception occurred:
[ 2690s]
[ 2690s] Traceback (most recent call last):
[ 2690s]   File "/home/abuild/rpmbuild/BUILD/Python-3.11.0a1/Lib/test/test_concurrent_futures.py", line 1179, in test_crash_during_func_exec_on_worker
[ 2690s]     self._check_crash(BrokenProcessPool, _crash)
[ 2690s]     ^^^^^^^^^^^^^^^^^^^^^^^^^^^^^^^^^^^^^^^^^^^^
[ 2690s]   File "/home/abuild/rpmbuild/BUILD/Python-3.11.0a1/Lib/test/test_concurrent_futures.py", line 1157, in _check_crash
[ 2690s]     self._fail_on_deadlock(executor)
[ 2690s]     ^^^^^^^^^^^^^^^^^^^^^^^^^^^^^^^^
[ 2690s]   File "/home/abuild/rpmbuild/BUILD/Python-3.11.0a1/Lib/test/test_concurrent_futures.py", line 1134, in _fail_on_deadlock
[ 2690s]     self.fail(f"Executor deadlock:\n\n{tb}")
[ 2690s]     ^^^^^^^^^^^^^^^^^^^^^^^^^^^^^^^^^^^^^^^^
[ 2690s] AssertionError: Executor deadlock:
[ 2690s]
[ 2690s] Thread 0x00007fa69effd700 (most recent call first):
[ 2690s]   File "/home/abuild/rpmbuild/BUILD/Python-3.11.0a1/Lib/threading.py", line 320 in wait
[ 2690s]   File "/home/abuild/rpmbuild/BUILD/Python-3.11.0a1/Lib/multiprocessing/queues.py", line 233 in _feed
[ 2690s]   File "/home/abuild/rpmbuild/BUILD/Python-3.11.0a1/Lib/threading.py", line 968 in run
[ 2690s]   File "/home/abuild/rpmbuild/BUILD/Python-3.11.0a1/Lib/threading.py", line 1031 in _bootstrap_inner
[ 2690s]   File "/home/abuild/rpmbuild/BUILD/Python-3.11.0a1/Lib/threading.py", line 988 in _bootstrap
[ 2690s]
[ 2690s] Thread 0x00007fa6c17fa700 (most recent call first):
[ 2690s]   File "/home/abuild/rpmbuild/BUILD/Python-3.11.0a1/Lib/selectors.py", line 416 in select
[ 2690s]   File "/home/abuild/rpmbuild/BUILD/Python-3.11.0a1/Lib/multiprocessing/connection.py", line 936 in wait
[ 2690s]   File "/home/abuild/rpmbuild/BUILD/Python-3.11.0a1/Lib/concurrent/futures/process.py", line 376 in wait_result_broken_or_wakeup
[ 2690s]   File "/home/abuild/rpmbuild/BUILD/Python-3.11.0a1/Lib/concurrent/futures/process.py", line 316 in run
[ 2690s]   File "/home/abuild/rpmbuild/BUILD/Python-3.11.0a1/Lib/threading.py", line 1031 in _bootstrap_inner
[ 2690s]   File "/home/abuild/rpmbuild/BUILD/Python-3.11.0a1/Lib/threading.py", line 988 in _bootstrap
[ 2690s]
[ 2690s] Current thread 0x00007fa6e90e5740 (most recent call first):
[ 2690s]   File "/home/abuild/rpmbuild/BUILD/Python-3.11.0a1/Lib/test/test_concurrent_futures.py", line 1125 in _fail_on_deadlock
[ 2690s]   File "/home/abuild/rpmbuild/BUILD/Python-3.11.0a1/Lib/test/test_concurrent_futures.py", line 1157 in _check_crash
[ 2690s]   File "/home/abuild/rpmbuild/BUILD/Python-3.11.0a1/Lib/test/test_concurrent_futures.py", line 1179 in test_crash_during_func_exec_on_worker
[ 2690s]   File "/home/abuild/rpmbuild/BUILD/Python-3.11.0a1/Lib/unittest/case.py", line 547 in _callTestMethod
[ 2690s]   File "/home/abuild/rpmbuild/BUILD/Python-3.11.0a1/Lib/unittest/case.py", line 591 in run
[ 2690s]   File "/home/abuild/rpmbuild/BUILD/Python-3.11.0a1/Lib/unittest/case.py", line 646 in __call__
[ 2690s]   File "/home/abuild/rpmbuild/BUILD/Python-3.11.0a1/Lib/unittest/suite.py", line 122 in run
[ 2690s]   File "/home/abuild/rpmbuild/BUILD/Python-3.11.0a1/Lib/unittest/suite.py", line 84 in __call__
[ 2690s]   File "/home/abuild/rpmbuild/BUILD/Python-3.11.0a1/Lib/unittest/suite.py", line 122 in run
[ 2690s]   File "/home/abuild/rpmbuild/BUILD/Python-3.11.0a1/Lib/unittest/suite.py", line 84 in __call__
[ 2690s]   File "/home/abuild/rpmbuild/BUILD/Python-3.11.0a1/Lib/unittest/suite.py", line 122 in run
[ 2690s]   File "/home/abuild/rpmbuild/BUILD/Python-3.11.0a1/Lib/unittest/suite.py", line 84 in __call__
[ 2690s]   File "/home/abuild/rpmbuild/BUILD/Python-3.11.0a1/Lib/unittest/runner.py", line 197 in run
[ 2690s]   File "/home/abuild/rpmbuild/BUILD/Python-3.11.0a1/Lib/test/support/__init__.py", line 992 in _run_suite
[ 2690s]   File "/home/abuild/rpmbuild/BUILD/Python-3.11.0a1/Lib/test/support/__init__.py", line 1118 in run_unittest
[ 2690s]   File "/home/abuild/rpmbuild/BUILD/Python-3.11.0a1/Lib/test/libregrtest/runtest.py", line 261 in _test_module
[ 2690s]   File "/home/abuild/rpmbuild/BUILD/Python-3.11.0a1/Lib/test/libregrtest/runtest.py", line 297 in _runtest_inner2
[ 2690s]   File "/home/abuild/rpmbuild/BUILD/Python-3.11.0a1/Lib/test/libregrtest/runtest.py", line 340 in _runtest_inner
[ 2690s]   File "/home/abuild/rpmbuild/BUILD/Python-3.11.0a1/Lib/test/libregrtest/runtest.py", line 215 in _runtest
[ 2690s]   File "/home/abuild/rpmbuild/BUILD/Python-3.11.0a1/Lib/test/libregrtest/runtest.py", line 245 in runtest
[ 2690s]   File "/home/abuild/rpmbuild/BUILD/Python-3.11.0a1/Lib/test/libregrtest/main.py", line 337 in rerun_failed_tests
[ 2690s]   File "/home/abuild/rpmbuild/BUILD/Python-3.11.0a1/Lib/test/libregrtest/main.py", line 715 in _main
[ 2690s]   File "/home/abuild/rpmbuild/BUILD/Python-3.11.0a1/Lib/test/libregrtest/main.py", line 658 in main
[ 2690s]   File "/home/abuild/rpmbuild/BUILD/Python-3.11.0a1/Lib/test/libregrtest/main.py", line 736 in main
[ 2690s]   File "/home/abuild/rpmbuild/BUILD/Python-3.11.0a1/Lib/test/regrtest.py", line 43 in _main
[ 2690s]   File "/home/abuild/rpmbuild/BUILD/Python-3.11.0a1/Lib/test/regrtest.py", line 47 in <module>
[ 2690s]   File "/home/abuild/rpmbuild/BUILD/Python-3.11.0a1/Lib/runpy.py", line 86 in _run_code
[ 2690s]   File "/home/abuild/rpmbuild/BUILD/Python-3.11.0a1/Lib/runpy.py", line 196 in _run_module_as_main
[ 2690s]
[ 2690s]
[ 2690s] ======================================================================
[ 2690s] FAIL: test_crash_during_result_pickle_on_worker (test.test_concurrent_futures.ProcessPoolSpawnExecutorDeadlockTest)
[ 2690s] ----------------------------------------------------------------------
[ 2690s] test test_concurrent_futures failed
[ 2690s] Traceback (most recent call last):
[ 2690s]   File "/home/abuild/rpmbuild/BUILD/Python-3.11.0a1/Lib/test/test_concurrent_futures.py", line 1153, in _check_crash
[ 2690s]     res.result(timeout=self.TIMEOUT)
[ 2690s]     ^^^^^^^^^^^^^^^^^^^^^^^^^^^^^^^^
[ 2690s]   File "/home/abuild/rpmbuild/BUILD/Python-3.11.0a1/Lib/concurrent/futures/_base.py", line 447, in result
[ 2690s]     raise TimeoutError()
[ 2690s]     ^^^^^^^^^^^^^^^^^^^^
[ 2690s] concurrent.futures._base.TimeoutError
[ 2690s]
[ 2690s] During handling of the above exception, another exception occurred:
[ 2690s]
[ 2690s] Traceback (most recent call last):
[ 2690s]   File "/home/abuild/rpmbuild/BUILD/Python-3.11.0a1/Lib/test/test_concurrent_futures.py", line 1192, in test_crash_during_result_pickle_on_worker
[ 2690s]     self._check_crash(BrokenProcessPool, _return_instance, CrashAtPickle)
[ 2690s]     ^^^^^^^^^^^^^^^^^^^^^^^^^^^^^^^^^^^^^^^^^^^^^^^^^^^^^^^^^^^^^^^^^^^^^
[ 2690s]   File "/home/abuild/rpmbuild/BUILD/Python-3.11.0a1/Lib/test/test_concurrent_futures.py", line 1157, in _check_crash
[ 2690s]     self._fail_on_deadlock(executor)
[ 2690s]     ^^^^^^^^^^^^^^^^^^^^^^^^^^^^^^^^
[ 2690s]   File "/home/abuild/rpmbuild/BUILD/Python-3.11.0a1/Lib/test/test_concurrent_futures.py", line 1134, in _fail_on_deadlock
[ 2690s]     self.fail(f"Executor deadlock:\n\n{tb}")
[ 2690s]     ^^^^^^^^^^^^^^^^^^^^^^^^^^^^^^^^^^^^^^^^
[ 2690s] AssertionError: Executor deadlock:
[ 2690s]
[ 2690s] Thread 0x00007fa69effd700 (most recent call first):
[ 2690s]   File "/home/abuild/rpmbuild/BUILD/Python-3.11.0a1/Lib/threading.py", line 320 in wait
[ 2690s]   File "/home/abuild/rpmbuild/BUILD/Python-3.11.0a1/Lib/multiprocessing/queues.py", line 233 in _feed
[ 2690s]   File "/home/abuild/rpmbuild/BUILD/Python-3.11.0a1/Lib/threading.py", line 968 in run
[ 2690s]   File "/home/abuild/rpmbuild/BUILD/Python-3.11.0a1/Lib/threading.py", line 1031 in _bootstrap_inner
[ 2690s]   File "/home/abuild/rpmbuild/BUILD/Python-3.11.0a1/Lib/threading.py", line 988 in _bootstrap
[ 2690s]
[ 2690s] Thread 0x00007fa6c17fa700 (most recent call first):
[ 2690s]   File "/home/abuild/rpmbuild/BUILD/Python-3.11.0a1/Lib/selectors.py", line 416 in select
[ 2690s]   File "/home/abuild/rpmbuild/BUILD/Python-3.11.0a1/Lib/multiprocessing/connection.py", line 936 in wait
[ 2690s]   File "/home/abuild/rpmbuild/BUILD/Python-3.11.0a1/Lib/concurrent/futures/process.py", line 376 in wait_result_broken_or_wakeup
[ 2690s]   File "/home/abuild/rpmbuild/BUILD/Python-3.11.0a1/Lib/concurrent/futures/process.py", line 316 in run
[ 2690s]   File "/home/abuild/rpmbuild/BUILD/Python-3.11.0a1/Lib/threading.py", line 1031 in _bootstrap_inner
[ 2690s]   File "/home/abuild/rpmbuild/BUILD/Python-3.11.0a1/Lib/threading.py", line 988 in _bootstrap
[ 2690s]
[ 2690s] Current thread 0x00007fa6e90e5740 (most recent call first):
[ 2690s]   File "/home/abuild/rpmbuild/BUILD/Python-3.11.0a1/Lib/test/test_concurrent_futures.py", line 1125 in _fail_on_deadlock
[ 2690s]   File "/home/abuild/rpmbuild/BUILD/Python-3.11.0a1/Lib/test/test_concurrent_futures.py", line 1157 in _check_crash
[ 2690s]   File "/home/abuild/rpmbuild/BUILD/Python-3.11.0a1/Lib/test/test_concurrent_futures.py", line 1192 in test_crash_during_result_pickle_on_worker
[ 2690s]   File "/home/abuild/rpmbuild/BUILD/Python-3.11.0a1/Lib/unittest/case.py", line 547 in _callTestMethod
[ 2690s]   File "/home/abuild/rpmbuild/BUILD/Python-3.11.0a1/Lib/unittest/case.py", line 591 in run
[ 2690s]   File "/home/abuild/rpmbuild/BUILD/Python-3.11.0a1/Lib/unittest/case.py", line 646 in __call__
[ 2690s]   File "/home/abuild/rpmbuild/BUILD/Python-3.11.0a1/Lib/unittest/suite.py", line 122 in run
[ 2690s]   File "/home/abuild/rpmbuild/BUILD/Python-3.11.0a1/Lib/unittest/suite.py", line 84 in __call__
[ 2690s]   File "/home/abuild/rpmbuild/BUILD/Python-3.11.0a1/Lib/unittest/suite.py", line 122 in run
[ 2690s]   File "/home/abuild/rpmbuild/BUILD/Python-3.11.0a1/Lib/unittest/suite.py", line 84 in __call__
[ 2690s]   File "/home/abuild/rpmbuild/BUILD/Python-3.11.0a1/Lib/unittest/suite.py", line 122 in run
[ 2690s]   File "/home/abuild/rpmbuild/BUILD/Python-3.11.0a1/Lib/unittest/suite.py", line 84 in __call__
[ 2690s]   File "/home/abuild/rpmbuild/BUILD/Python-3.11.0a1/Lib/unittest/runner.py", line 197 in run
[ 2690s]   File "/home/abuild/rpmbuild/BUILD/Python-3.11.0a1/Lib/test/support/__init__.py", line 992 in _run_suite
[ 2690s]   File "/home/abuild/rpmbuild/BUILD/Python-3.11.0a1/Lib/test/support/__init__.py", line 1118 in run_unittest
[ 2690s]   File "/home/abuild/rpmbuild/BUILD/Python-3.11.0a1/Lib/test/libregrtest/runtest.py", line 261 in _test_module
[ 2690s]   File "/home/abuild/rpmbuild/BUILD/Python-3.11.0a1/Lib/test/libregrtest/runtest.py", line 297 in _runtest_inner2
[ 2690s]   File "/home/abuild/rpmbuild/BUILD/Python-3.11.0a1/Lib/test/libregrtest/runtest.py", line 340 in _runtest_inner
[ 2690s]   File "/home/abuild/rpmbuild/BUILD/Python-3.11.0a1/Lib/test/libregrtest/runtest.py", line 215 in _runtest
[ 2690s]   File "/home/abuild/rpmbuild/BUILD/Python-3.11.0a1/Lib/test/libregrtest/runtest.py", line 245 in runtest
[ 2690s]   File "/home/abuild/rpmbuild/BUILD/Python-3.11.0a1/Lib/test/libregrtest/main.py", line 337 in rerun_failed_tests
[ 2690s]   File "/home/abuild/rpmbuild/BUILD/Python-3.11.0a1/Lib/test/libregrtest/main.py", line 715 in _main
[ 2690s]   File "/home/abuild/rpmbuild/BUILD/Python-3.11.0a1/Lib/test/libregrtest/main.py", line 658 in main
[ 2690s]   File "/home/abuild/rpmbuild/BUILD/Python-3.11.0a1/Lib/test/libregrtest/main.py", line 736 in main
[ 2690s]   File "/home/abuild/rpmbuild/BUILD/Python-3.11.0a1/Lib/test/regrtest.py", line 43 in _main
[ 2690s]   File "/home/abuild/rpmbuild/BUILD/Python-3.11.0a1/Lib/test/regrtest.py", line 47 in <module>
[ 2690s]   File "/home/abuild/rpmbuild/BUILD/Python-3.11.0a1/Lib/runpy.py", line 86 in _run_code
[ 2690s]   File "/home/abuild/rpmbuild/BUILD/Python-3.11.0a1/Lib/runpy.py", line 196 in _run_module_as_main
[ 2690s]
[ 2690s]
[ 2690s] ----------------------------------------------------------------------
[ 2690s] Ran 9 tests in 723.733s
[ 2690s]
[ 2690s] FAILED (failures=9)
[ 2690s] 3 tests failed again:
[ 2690s]     test_concurrent_futures test_exceptions test_tools
[ 2690s]
[ 2690s] == Tests result: FAILURE then FAILURE ==
[ 2690s]
[ 2690s] 401 tests OK.
[ 2690s]
[ 2690s] 10 slowest tests:
[ 2690s] - test_capi: 28 min 19 sec
[ 2690s] - test_faulthandler: 21 min 7 sec
[ 2690s] - test_concurrent_futures: 18 min 53 sec
[ 2690s] - test_io: 3 min 23 sec
[ 2690s] - test_peg_generator: 3 min 5 sec
[ 2690s] - test_subprocess: 2 min 49 sec
[ 2690s] - test_multiprocessing_spawn: 2 min 36 sec
[ 2690s] - test_audit: 2 min 15 sec
[ 2690s] - test_multiprocessing_forkserver: 1 min 43 sec
[ 2690s] - test_regrtest: 1 min 42 sec
[ 2690s]
[ 2690s] 3 tests failed:
[ 2690s]     test_concurrent_futures test_exceptions test_tools
[ 2690s]
[ 2690s] 19 tests skipped:
[ 2690s]     test_curses test_devpoll test_ioctl test_kqueue test_msilib
[ 2690s]     test_ossaudiodev test_smtpnet test_socketserver test_startfile
[ 2690s]     test_tix test_tk test_ttk_guionly test_urllib2net test_urllibnet
[ 2690s]     test_winconsoleio test_winreg test_winsound test_xmlrpc_net
[ 2690s]     test_zipfile64
[ 2690s]
[ 2690s] 3 re-run tests:
[ 2690s]     test_concurrent_futures test_exceptions test_tools
[ 2690s]
[ 2690s] Total duration: 40 min 27 sec
[ 2690s] Tests result: FAILURE then FAILURE
[ 2690s] error: Bad exit status from /var/tmp/rpm-tmp.f6B040 (%check)
History
Date User Action Args
2021-10-14 00:03:13sxt1001setrecipients: + sxt1001, Asheesh.Laroia, serhiy.storchaka, shihai1991
2021-10-14 00:03:13sxt1001setmessageid: <1634169793.16.0.51579562399.issue45444@roundup.psfhosted.org>
2021-10-14 00:03:13sxt1001linkissue45444 messages
2021-10-14 00:03:12sxt1001create