Author vstinner
Recipients barry, brett.cannon, ncoghlan, v2m, vstinner
Date 2018-08-28.21:57:26
SpamBayes Score -1.0
Marked as misclassified Yes
Message-id <1535493446.35.0.56676864532.issue34200@psf.upfronthosting.co.za>
In-reply-to
Content
Recent failure on AMD64 Debian root 3.x:

https://buildbot.python.org/all/#/builders/27/builds/1433

0:07:40 load avg: 2.19 [278/418/1] test_pkg failed -- running: test_tools (1 min 18 sec)
test_1 (test.test_pkg.TestPkg) ... ok
test_2 (test.test_pkg.TestPkg) ... ok
test_3 (test.test_pkg.TestPkg) ... ok
test_4 (test.test_pkg.TestPkg) ... ERROR
test_5 (test.test_pkg.TestPkg) ... ok
test_6 (test.test_pkg.TestPkg) ... ok
test_7 (test.test_pkg.TestPkg) ... FAIL
test_8 (test.test_pkg.TestPkg) ... ok

======================================================================
ERROR: test_4 (test.test_pkg.TestPkg)
----------------------------------------------------------------------
Traceback (most recent call last):
  File "/root/buildarea/3.x.angelico-debian-amd64/build/Lib/test/test_pkg.py", line 180, in test_4
    self.run_code(s)
  File "/root/buildarea/3.x.angelico-debian-amd64/build/Lib/test/test_pkg.py", line 69, in run_code
    exec(textwrap.dedent(code), globals(), {"self": self})
  File "<string>", line 2, in <module>
  File "/tmp/tmpblwoj1h4/t4.py", line 1, in <module>
RuntimeError: Shouldnt load t4.py

======================================================================
FAIL: test_7 (test.test_pkg.TestPkg)
----------------------------------------------------------------------
Traceback (most recent call last):
  File "/root/buildarea/3.x.angelico-debian-amd64/build/Lib/test/test_pkg.py", line 260, in test_7
    '__name__', '__package__', '__path__', '__spec__'])
AssertionError: Lists differ: ['__c[34 chars]__loader__', '__name__', '__package__', '__spec__'] != ['__c[34 chars]__loader__', '__name__', '__package__', '__path__', '__spec__']

First differing element 6:
'__spec__'
'__path__'

Second list contains 1 additional elements.
First extra element 7:
'__spec__'

  ['__cached__',
   '__doc__',
   '__file__',
   '__loader__',
   '__name__',
   '__package__',
+  '__path__',
   '__spec__']

----------------------------------------------------------------------
Ran 8 tests in 0.038s

FAILED (failures=1, errors=1)
History
Date User Action Args
2018-08-28 21:57:26vstinnersetrecipients: + vstinner, barry, brett.cannon, ncoghlan, v2m
2018-08-28 21:57:26vstinnersetmessageid: <1535493446.35.0.56676864532.issue34200@psf.upfronthosting.co.za>
2018-08-28 21:57:26vstinnerlinkissue34200 messages
2018-08-28 21:57:26vstinnercreate