Author vstinner
Recipients paul.moore, steve.dower, tim.golden, vstinner, zach.ware
Date 2017-11-06.11:17:25
SpamBayes Score -1.0
Marked as misclassified Yes
Message-id <1509967046.04.0.213398074469.issue31957@psf.upfronthosting.co.za>
In-reply-to
Content
http://buildbot.python.org/all/#/builders/58/builds/110

Build started 11/4/2017 7:30:21 PM.
Project "D:\cygwin\home\db3l\buildarea\3.x.bolen-windows7\build\PCbuild\pythoncore.vcxproj" on node 1 (KillPython target(s)).
D:\cygwin\home\db3l\buildarea\3.x.bolen-windows7\build\PCbuild\python.props(77,31): error MSB4086: A numeric comparison was attempted on "$(Registry:HKEY_LOCAL_MACHINE\SOFTWARE\WOW6432Node\Microsoft\Microsoft SDKs\Windows\v10.0@ProductVersion)" that evaluates to "" instead of a number, in condition "$(Registry:HKEY_LOCAL_MACHINE\SOFTWARE\WOW6432Node\Microsoft\Microsoft SDKs\Windows\v10.0@ProductVersion) >= '10.0.15063'". [D:\cygwin\home\db3l\buildarea\3.x.bolen-windows7\build\PCbuild\pythoncore.vcxproj]
Done Building Project "D:\cygwin\home\db3l\buildarea\3.x.bolen-windows7\build\PCbuild\pythoncore.vcxproj" (KillPython target(s)) -- FAILED.
Build FAILED.

It's likely a regression caused by one of these commits:

* 0d2a9088d16826343344b04461c8be44b4008710
* aed08562220974b5c67371b908f23caa1be07e38
History
Date User Action Args
2017-11-06 11:17:26vstinnersetrecipients: + vstinner, paul.moore, tim.golden, zach.ware, steve.dower
2017-11-06 11:17:26vstinnersetmessageid: <1509967046.04.0.213398074469.issue31957@psf.upfronthosting.co.za>
2017-11-06 11:17:26vstinnerlinkissue31957 messages
2017-11-06 11:17:25vstinnercreate