Author martin.panter
Recipients Jonathan Ng, martin.panter, python-dev, serhiy.storchaka
Date 2016-12-03.04:12:55
SpamBayes Score -1.0
Marked as misclassified Yes
Message-id <1480738376.88.0.148676883749.issue28847@psf.upfronthosting.co.za>
In-reply-to
Content
http://buildbot.python.org/all/builders/AMD64%20Windows8%202.7/builds/9/steps/test/logs/stdio
======================================================================
ERROR: test_readonly_files (test.test_dumbdbm.DumbDBMTestCase)
----------------------------------------------------------------------
Traceback (most recent call last):
  File "D:\buildarea\2.7.bolen-windows8\build\lib\test\test_dumbdbm.py", line 190, in test_readonly_files
    test_support.rmtree(dir)
  File "D:\buildarea\2.7.bolen-windows8\build\lib\test\test_support.py", line 289, in rmtree
    _rmtree(path)
  File "D:\buildarea\2.7.bolen-windows8\build\lib\test\test_support.py", line 245, in _rmtree
    _waitfor(_rmtree_inner, path, waitall=True)
  File "D:\buildarea\2.7.bolen-windows8\build\lib\test\test_support.py", line 199, in _waitfor
    func(pathname)
  File "D:\buildarea\2.7.bolen-windows8\build\lib\test\test_support.py", line 244, in _rmtree_inner
    _force_run(path, os.unlink, fullname)
  File "D:\buildarea\2.7.bolen-windows8\build\lib\test\test_support.py", line 194, in _force_run
    return func(*args)
WindowsError: [Error 5] Access is denied: '@test_3796_tmp\\db.dat'

----------------------------------------------------------------------
'test_dumbdbm' left behind directory '@test_3796_tmp'
. . .
test test_dumbdbm crashed -- <type 'exceptions.WindowsError'>: [Error 5] Access is denied: '@test_3796_tmp\\db.dat'
Traceback (most recent call last):
  File "D:\buildarea\2.7.bolen-windows8\build\PCbuild\..\Lib\test\regrtest.py", line 948, in runtest_inner
    test_time = time.time() - start_time
  File "D:\buildarea\2.7.bolen-windows8\build\PCbuild\..\Lib\test\regrtest.py", line 899, in __exit__
    restore(original)
  File "D:\buildarea\2.7.bolen-windows8\build\PCbuild\..\Lib\test\regrtest.py", line 876, in restore_files
    test_support.rmtree(fn)
. . .
'test_dumbdbm' left behind directory '@test_3796_tmp' and it couldn't be removed: [Error 5] Access is denied: '@test_3796_tmp\\db.dat'
Traceback (most recent call last):
  File "D:\buildarea\2.7.bolen-windows8\build\PCbuild\..\Lib\test\regrtest.py", line 1679, in <module>
    main()
  File "D:\buildarea\2.7.bolen-windows8\build\lib\contextlib.py", line 35, in __exit__
    self.gen.throw(type, value, traceback)
  File "D:\buildarea\2.7.bolen-windows8\build\lib\test\test_support.py", line 765, in temp_cwd
    rmtree(name)
History
Date User Action Args
2016-12-03 04:12:56martin.pantersetrecipients: + martin.panter, python-dev, serhiy.storchaka, Jonathan Ng
2016-12-03 04:12:56martin.pantersetmessageid: <1480738376.88.0.148676883749.issue28847@psf.upfronthosting.co.za>
2016-12-03 04:12:56martin.panterlinkissue28847 messages
2016-12-03 04:12:55martin.pantercreate