Author kesara
Recipients Arfrever, alexis, carljm, dstufft, eric.araujo, kesara, rbcollins, tarek, vinay.sajip, ysj.ray
Date 2016-09-13.04:47:32
SpamBayes Score -1.0
Marked as misclassified Yes
Message-id <1473742053.19.0.37111548171.issue6087@psf.upfronthosting.co.za>
In-reply-to
Content
Test output:

[cpython.25567]$ ./python.exe -m test test_distutils test_sysconfig -j3
Run tests in parallel using 3 child processes
0:00:01 [1/2/1] test_sysconfig failed
test test_sysconfig failed -- Traceback (most recent call last):
  File "/Users/kesara/pycon/cpython.25567/Lib/test/test_sysconfig.py", line 283, in test_user_similar
    self.assertEqual(user_path, global_path.replace(base, user, 1))
AssertionError: '/Users/kesara/.local/lib/python3.6' != '/Users/kesara/pycon/cpython.25567/Lib'
- /Users/kesara/.local/lib/python3.6
+ /Users/kesara/pycon/cpython.25567/Lib
0:00:05 [2/2/2] test_distutils failed
test test_distutils failed -- Traceback (most recent call last):
  File "/Users/kesara/pycon/cpython.25567/Lib/distutils/tests/test_sysconfig.py", line 40, in test_get_python_lib
    sysconfig.get_python_lib(prefix=TESTFN))
AssertionError: '/Users/kesara/pycon/cpython.25567/Lib' == '/Users/kesara/pycon/cpython.25567/Lib'

2 tests failed:
    test_distutils test_sysconfig

Total duration: 6 sec
Tests result: FAILURE
History
Date User Action Args
2016-09-13 04:47:33kesarasetrecipients: + kesara, vinay.sajip, rbcollins, tarek, carljm, eric.araujo, Arfrever, ysj.ray, alexis, dstufft
2016-09-13 04:47:33kesarasetmessageid: <1473742053.19.0.37111548171.issue6087@psf.upfronthosting.co.za>
2016-09-13 04:47:33kesaralinkissue6087 messages
2016-09-13 04:47:32kesaracreate