Author vstinner
Recipients Arfrever, Nicholas.Cole, akuchling, cben, gpolo, inigoserna, jcea, john.feuerstein, nadeem.vawda, petri.lehtinen, pitrou, python-dev, r.david.murray, schodet, vstinner, zeha
Date 2011-11-28.06:31:04
SpamBayes Score 0.000450635
Marked as misclassified No
Message-id <1322461866.07.0.473008683406.issue12567@psf.upfronthosting.co.za>
In-reply-to
Content
Compile output on OpenSolaris:

Consider setting $PYTHONHOME to <prefix>[:<exec_prefix>]
ld: fatal: file /usr/local/lib/libncursesw.so: wrong ELF class: ELFCLASS32
ld: fatal: file processing errors. No output written to build/lib.solaris-2.11-i86pc-3.3-pydebug/readline.so
collect2: ld returned 1 exit status
/export/home/buildbot/64bits/3.x.cea-indiana-amd64/build/Modules/_cursesmodule.c:279: error: expected declaration specifiers or '...' before 'cchar_t'
/export/home/buildbot/64bits/3.x.cea-indiana-amd64/build/Modules/_cursesmodule.c: In function 'PyCurses_ConvertToCchar_t':
/export/home/buildbot/64bits/3.x.cea-indiana-amd64/build/Modules/_cursesmodule.c:298: error: 'wch' undeclared (first use in this function)
/export/home/buildbot/64bits/3.x.cea-indiana-amd64/build/Modules/_cursesmodule.c:298: error: (Each undeclared identifier is reported only once
/export/home/buildbot/64bits/3.x.cea-indiana-amd64/build/Modules/_cursesmodule.c:298: error: for each function it appears in.)
/export/home/buildbot/64bits/3.x.cea-indiana-amd64/build/Modules/_cursesmodule.c: In function 'PyCursesWindow_AddCh':
/export/home/buildbot/64bits/3.x.cea-indiana-amd64/build/Modules/_cursesmodule.c:584: error: 'cchar_t' undeclared (first use in this function)
/export/home/buildbot/64bits/3.x.cea-indiana-amd64/build/Modules/_cursesmodule.c:584: error: expected ';' before 'wch'
/export/home/buildbot/64bits/3.x.cea-indiana-amd64/build/Modules/_cursesmodule.c:618: error: 'wch' undeclared (first use in this function)
/export/home/buildbot/64bits/3.x.cea-indiana-amd64/build/Modules/_cursesmodule.c:618: error: too many arguments to function 'PyCurses_ConvertToCchar_t'
/export/home/buildbot/64bits/3.x.cea-indiana-amd64/build/Modules/_cursesmodule.c:623: warning: implicit declaration of function 'mvwadd_wch'
/export/home/buildbot/64bits/3.x.cea-indiana-amd64/build/Modules/_cursesmodule.c:625: warning: implicit declaration of function 'wadd_wch'
/export/home/buildbot/64bits/3.x.cea-indiana-amd64/build/Modules/_cursesmodule.c: In function 'PyCursesWindow_AddStr':
/export/home/buildbot/64bits/3.x.cea-indiana-amd64/build/Modules/_cursesmodule.c:702: warning: implicit declaration of function 'mvwaddwstr'
/export/home/buildbot/64bits/3.x.cea-indiana-amd64/build/Modules/_cursesmodule.c:704: warning: implicit declaration of function 'waddwstr'
/export/home/buildbot/64bits/3.x.cea-indiana-amd64/build/Modules/_cursesmodule.c: In function 'PyCursesWindow_AddNStr':
/export/home/buildbot/64bits/3.x.cea-indiana-amd64/build/Modules/_cursesmodule.c:779: warning: implicit declaration of function 'mvwaddnwstr'
/export/home/buildbot/64bits/3.x.cea-indiana-amd64/build/Modules/_cursesmodule.c:781: warning: implicit declaration of function 'waddnwstr'
/export/home/buildbot/64bits/3.x.cea-indiana-amd64/build/Modules/_cursesmodule.c: In function 'PyCursesWindow_Get_WCh':
/export/home/buildbot/64bits/3.x.cea-indiana-amd64/build/Modules/_cursesmodule.c:1187: warning: implicit declaration of function 'wget_wch'
/export/home/buildbot/64bits/3.x.cea-indiana-amd64/build/Modules/_cursesmodule.c:1194: warning: implicit declaration of function 'mvwget_wch'
/export/home/buildbot/64bits/3.x.cea-indiana-amd64/build/Modules/_cursesmodule.c: In function 'PyCursesWindow_InsStr':
/export/home/buildbot/64bits/3.x.cea-indiana-amd64/build/Modules/_cursesmodule.c:1468: warning: implicit declaration of function 'mvwins_wstr'
/export/home/buildbot/64bits/3.x.cea-indiana-amd64/build/Modules/_cursesmodule.c:1470: warning: implicit declaration of function 'wins_wstr'
/export/home/buildbot/64bits/3.x.cea-indiana-amd64/build/Modules/_cursesmodule.c: In function 'PyCursesWindow_InsNStr':
/export/home/buildbot/64bits/3.x.cea-indiana-amd64/build/Modules/_cursesmodule.c:1546: warning: implicit declaration of function 'mvwins_nwstr'
/export/home/buildbot/64bits/3.x.cea-indiana-amd64/build/Modules/_cursesmodule.c:1548: warning: implicit declaration of function 'wins_nwstr'
/export/home/buildbot/64bits/3.x.cea-indiana-amd64/build/Modules/_cursesmodule.c: In function 'PyCurses_Unget_Wch':
/export/home/buildbot/64bits/3.x.cea-indiana-amd64/build/Modules/_cursesmodule.c:3130: warning: implicit declaration of function 'unget_wch'
ld: fatal: file /usr/local/lib/libpanelw.so: wrong ELF class: ELFCLASS32
ld: fatal: file /usr/local/lib/libncursesw.so: wrong ELF class: ELFCLASS32
ld: fatal: file processing errors. No output written to build/lib.solaris-2.11-i86pc-3.3-pydebug/_curses_panel.so
collect2: ld returned 1 exit status
History
Date User Action Args
2011-11-28 06:31:06vstinnersetrecipients: + vstinner, akuchling, jcea, cben, pitrou, nadeem.vawda, gpolo, Arfrever, r.david.murray, inigoserna, zeha, schodet, python-dev, petri.lehtinen, Nicholas.Cole, john.feuerstein
2011-11-28 06:31:06vstinnersetmessageid: <1322461866.07.0.473008683406.issue12567@psf.upfronthosting.co.za>
2011-11-28 06:31:05vstinnerlinkissue12567 messages
2011-11-28 06:31:04vstinnercreate