Author Jason.Vas.Dias
Recipients Jason.Vas.Dias
Date 2011-04-29.12:52:22
SpamBayes Score 7.01461e-05
Marked as misclassified No
Message-id <1304081551.62.0.367373814357.issue11954@psf.upfronthosting.co.za>
In-reply-to
Content
[ 16/354] test_argparse
... # all ok up to:
test_wb_1 (test.test_argparse.TestFileTypeRepr) ... ok
test_failures_many_groups_listargs (test.test_argparse.TestFileTypeW) ... FAIL
test_failures_many_groups_sysargs (test.test_argparse.TestFileTypeW) ... FAIL
test_failures_no_groups_listargs (test.test_argparse.TestFileTypeW) ... FAIL
test_failures_no_groups_sysargs (test.test_argparse.TestFileTypeW) ... FAIL
test_failures_one_group_listargs (test.test_argparse.TestFileTypeW) ... FAIL
test_failures_one_group_sysargs (test.test_argparse.TestFileTypeW) ... FAIL
test_successes_many_groups_listargs (test.test_argparse.TestFileTypeW) ... ok
...
test_successes_one_group_sysargs (test.test_argparse.TestTypeUserDefined) ... test test_argparse failed -- multiple errors occurred
ok

======================================================================
FAIL: test_failures_many_groups_listargs (test.test_argparse.TestFileTypeW)
----------------------------------------------------------------------
Traceback (most recent call last):
  File "/usr/src/cpython/Lib/test/test_argparse.py", line 216, in wrapper
    test_func(self)
  File "/usr/src/cpython/Lib/test/test_argparse.py", line 235, in test_failures
    raises(ArgumentParserError, parser.parse_args, args)
AssertionError: ArgumentParserError not raised by parse_args

======================================================================
FAIL: test_failures_many_groups_sysargs (test.test_argparse.TestFileTypeW)
----------------------------------------------------------------------
Traceback (most recent call last):
  File "/usr/src/cpython/Lib/test/test_argparse.py", line 216, in wrapper
    test_func(self)
  File "/usr/src/cpython/Lib/test/test_argparse.py", line 235, in test_failures
    raises(ArgumentParserError, parser.parse_args, args)
AssertionError: ArgumentParserError not raised by parse_args

======================================================================
FAIL: test_failures_no_groups_listargs (test.test_argparse.TestFileTypeW)
----------------------------------------------------------------------
Traceback (most recent call last):
  File "/usr/src/cpython/Lib/test/test_argparse.py", line 216, in wrapper
    test_func(self)
  File "/usr/src/cpython/Lib/test/test_argparse.py", line 235, in test_failures
    raises(ArgumentParserError, parser.parse_args, args)
AssertionError: ArgumentParserError not raised by parse_args

======================================================================
FAIL: test_failures_no_groups_sysargs (test.test_argparse.TestFileTypeW)
----------------------------------------------------------------------
Traceback (most recent call last):
  File "/usr/src/cpython/Lib/test/test_argparse.py", line 216, in wrapper
    test_func(self)
  File "/usr/src/cpython/Lib/test/test_argparse.py", line 235, in test_failures
    raises(ArgumentParserError, parser.parse_args, args)
AssertionError: ArgumentParserError not raised by parse_args

======================================================================
FAIL: test_failures_one_group_listargs (test.test_argparse.TestFileTypeW)
----------------------------------------------------------------------
Traceback (most recent call last):
  File "/usr/src/cpython/Lib/test/test_argparse.py", line 216, in wrapper
    test_func(self)
  File "/usr/src/cpython/Lib/test/test_argparse.py", line 235, in test_failures
    raises(ArgumentParserError, parser.parse_args, args)
AssertionError: ArgumentParserError not raised by parse_args

======================================================================
FAIL: test_failures_one_group_sysargs (test.test_argparse.TestFileTypeW)
----------------------------------------------------------------------
Traceback (most recent call last):
  File "/usr/src/cpython/Lib/test/test_argparse.py", line 216, in wrapper
    test_func(self)
  File "/usr/src/cpython/Lib/test/test_argparse.py", line 235, in test_failures
    raises(ArgumentParserError, parser.parse_args, args)
AssertionError: ArgumentParserError not raised by parse_args

----------------------------------------------------------------------
Ran 1608 tests in 6.725s

FAILED (failures=6)
[ 17/354] test_array
History
Date User Action Args
2011-04-29 12:52:31Jason.Vas.Diassetrecipients: + Jason.Vas.Dias
2011-04-29 12:52:31Jason.Vas.Diassetmessageid: <1304081551.62.0.367373814357.issue11954@psf.upfronthosting.co.za>
2011-04-29 12:52:22Jason.Vas.Diaslinkissue11954 messages
2011-04-29 12:52:22Jason.Vas.Diascreate