Author vstinner
Recipients benjamin.peterson, vstinner
Date 2010-11-06.11:12:36
SpamBayes Score 0.0301275
Marked as misclassified No
Message-id <1289041958.15.0.549624913321.issue10338@psf.upfronthosting.co.za>
In-reply-to
Content
http://www.python.org/dev/buildbot/builders/x86%20debian%20parallel%203.x/builds/806/steps/test/logs/stdio

test test_lib2to3 failed -- multiple errors occurred

======================================================================
ERROR: test_bom (lib2to3.tests.test_refactor.TestRefactoringTool)
----------------------------------------------------------------------
Traceback (most recent call last):
  File "/home2/buildbot2/slave/3.x.loewis-parallel/build/Lib/lib2to3/tests/test_refactor.py", line 239, in test_bom
    data = self.check_file_refactoring(fn)
  File "/home2/buildbot2/slave/3.x.loewis-parallel/build/Lib/lib2to3/tests/test_refactor.py", line 186, in check_file_refactoring
    rt.refactor_file(test_file)
  File "/home2/buildbot2/slave/3.x.loewis-parallel/build/Lib/lib2to3/refactor.py", line 348, in refactor_file
    tree = self.refactor_string(input, filename)
  File "/home2/buildbot2/slave/3.x.loewis-parallel/build/Lib/lib2to3/refactor.py", line 380, in refactor_string
    self.refactor_tree(tree, name)
  File "/home2/buildbot2/slave/3.x.loewis-parallel/build/Lib/lib2to3/refactor.py", line 441, in refactor_tree
    find_root(node)
  File "/home2/buildbot2/slave/3.x.loewis-parallel/build/Lib/lib2to3/fixer_util.py", line 276, in find_root
    while node.type != syms.file_input:
AttributeError: 'NoneType' object has no attribute 'type'

======================================================================
ERROR: test_crlf_newlines (lib2to3.tests.test_refactor.TestRefactoringTool)
----------------------------------------------------------------------
Traceback (most recent call last):
  File "/home2/buildbot2/slave/3.x.loewis-parallel/build/Lib/lib2to3/tests/test_refactor.py", line 248, in test_crlf_newlines
    self.check_file_refactoring(fn, fixes)
  File "/home2/buildbot2/slave/3.x.loewis-parallel/build/Lib/lib2to3/tests/test_refactor.py", line 186, in check_file_refactoring
    rt.refactor_file(test_file)
  File "/home2/buildbot2/slave/3.x.loewis-parallel/build/Lib/lib2to3/refactor.py", line 348, in refactor_file
    tree = self.refactor_string(input, filename)
  File "/home2/buildbot2/slave/3.x.loewis-parallel/build/Lib/lib2to3/refactor.py", line 380, in refactor_string
    self.refactor_tree(tree, name)
  File "/home2/buildbot2/slave/3.x.loewis-parallel/build/Lib/lib2to3/refactor.py", line 441, in refactor_tree
    find_root(node)
  File "/home2/buildbot2/slave/3.x.loewis-parallel/build/Lib/lib2to3/fixer_util.py", line 276, in find_root
    while node.type != syms.file_input:
AttributeError: 'NoneType' object has no attribute 'type'

======================================================================
ERROR: test_file_encoding (lib2to3.tests.test_refactor.TestRefactoringTool)
----------------------------------------------------------------------
Traceback (most recent call last):
  File "/home2/buildbot2/slave/3.x.loewis-parallel/build/Lib/lib2to3/tests/test_refactor.py", line 235, in test_file_encoding
    self.check_file_refactoring(fn)
  File "/home2/buildbot2/slave/3.x.loewis-parallel/build/Lib/lib2to3/tests/test_refactor.py", line 186, in check_file_refactoring
    rt.refactor_file(test_file)
  File "/home2/buildbot2/slave/3.x.loewis-parallel/build/Lib/lib2to3/refactor.py", line 348, in refactor_file
    tree = self.refactor_string(input, filename)
  File "/home2/buildbot2/slave/3.x.loewis-parallel/build/Lib/lib2to3/refactor.py", line 380, in refactor_string
    self.refactor_tree(tree, name)
  File "/home2/buildbot2/slave/3.x.loewis-parallel/build/Lib/lib2to3/refactor.py", line 441, in refactor_tree
    find_root(node)
  File "/home2/buildbot2/slave/3.x.loewis-parallel/build/Lib/lib2to3/fixer_util.py", line 276, in find_root
    while node.type != syms.file_input:
AttributeError: 'NoneType' object has no attribute 'type'

======================================================================
ERROR: test_unencodable_diff (lib2to3.tests.test_main.TestMain)
----------------------------------------------------------------------
Traceback (most recent call last):
  File "/home2/buildbot2/slave/3.x.loewis-parallel/build/Lib/lib2to3/tests/test_main.py", line 36, in test_unencodable_diff
    ret = self.run_2to3_capture(["-"], input_stream, out_enc, err)
  File "/home2/buildbot2/slave/3.x.loewis-parallel/build/Lib/lib2to3/tests/test_main.py", line 25, in run_2to3_capture
    return main.main("lib2to3.fixes", args)
  File "/home2/buildbot2/slave/3.x.loewis-parallel/build/Lib/lib2to3/main.py", line 168, in main
    rt.refactor_stdin()
  File "/home2/buildbot2/slave/3.x.loewis-parallel/build/Lib/lib2to3/refactor.py", line 393, in refactor_stdin
    tree = self.refactor_string(input, "<stdin>")
  File "/home2/buildbot2/slave/3.x.loewis-parallel/build/Lib/lib2to3/refactor.py", line 380, in refactor_string
    self.refactor_tree(tree, name)
  File "/home2/buildbot2/slave/3.x.loewis-parallel/build/Lib/lib2to3/refactor.py", line 441, in refactor_tree
    find_root(node)
  File "/home2/buildbot2/slave/3.x.loewis-parallel/build/Lib/lib2to3/fixer_util.py", line 276, in find_root
    while node.type != syms.file_input:
AttributeError: 'NoneType' object has no attribute 'type'

----------------------------------------------------------------------
History
Date User Action Args
2010-11-06 11:12:38vstinnersetrecipients: + vstinner, benjamin.peterson
2010-11-06 11:12:38vstinnersetmessageid: <1289041958.15.0.549624913321.issue10338@psf.upfronthosting.co.za>
2010-11-06 11:12:36vstinnerlinkissue10338 messages
2010-11-06 11:12:36vstinnercreate