This issue tracker has been migrated to GitHub, and is currently read-only.
For more information, see the GitHub FAQs in the Python's Developer Guide.

classification
Title: test_pep263 fails
Type: crash Stage:
Components: Interpreter Core, Tests Versions: Python 3.0
process
Status: closed Resolution: fixed
Dependencies: Superseder:
Assigned To: Nosy List: christian.heimes, georg.brandl
Priority: high Keywords:

Created on 2008-01-23 08:25 by christian.heimes, last changed 2022-04-11 14:56 by admin. This issue is now closed.

Messages (2)
msg61567 - (view) Author: Christian Heimes (christian.heimes) * (Python committer) Date: 2008-01-23 08:25
$ ./python Lib/test/regrtest.py -v test_pep263
test_pep263
test_compilestring (test.test_pep263.PEP263Test) ... FAIL
test_pep263 (test.test_pep263.PEP263Test) ... ok

======================================================================
FAIL: test_compilestring (test.test_pep263.PEP263Test)
----------------------------------------------------------------------
Traceback (most recent call last):
  File "/home/heimes/dev/python/py3k/Lib/test/test_pep263.py", line 25,
in test_compilestring
AssertionError: '\xc3\xb3' != '\xf3'

----------------------------------------------------------------------
Ran 2 tests in 0.035s

FAILED (failures=1)
test test_pep263 failed -- Traceback (most recent call last):
  File "/home/heimes/dev/python/py3k/Lib/test/test_pep263.py", line 25,
in test_compilestring
AssertionError: '\xc3\xb3' != '\xf3'

1 test failed:
    test_pep263
msg61590 - (view) Author: Georg Brandl (georg.brandl) * (Python committer) Date: 2008-01-23 17:10
Fixed in r60220.
History
Date User Action Args
2022-04-11 14:56:30adminsetgithub: 46208
2008-01-23 17:10:50georg.brandlsetstatus: open -> closed
resolution: fixed
messages: + msg61590
nosy: + georg.brandl
2008-01-23 08:25:25christian.heimescreate