Author haypo
Recipients haypo, paul.moore, serhiy.storchaka, steve.dower, tim.golden, zach.ware
Date 2017-07-17.08:57:11
SpamBayes Score -1.0
Marked as misclassified Yes
Message-id <1500281831.2.0.234205489392.issue30850@psf.upfronthosting.co.za>
In-reply-to
Content
http://buildbot.python.org/all/builders/AMD64%20Windows8.1%20Refleaks%202.7/builds/50

...
test03_ThreadedTransactions (bsddb.test.test_thread.HashThreadedTransactions) ... ok
test03_ThreadedTransactions (bsddb.test.test_thread.BTreeThreadedNoWaitTransactions) ... ok
test03_ThreadedTransactions (bsddb.test.test_thread.HashThreadedNoWaitTransactions) ... ok
testCheckElapsedTime (test.test_bsddb3.TimingCheck) ... beginning 6 repetitions
123456
......
Berkeley DB 4.7.25: (May 15, 2008)
Test path prefix:  d:\temp\z-test_bsddb3-4292
XXX: timeout happened beforestartup was confirmed - see issue 3892
test test_bsddb3 failed -- Traceback (most recent call last):
  File "D:\buildarea\2.7.ware-win81-release.refleak\build\lib\bsddb\test\test_lock.py", line 132, in test04_lock_timeout2
    self.assertGreaterEqual(end_time-start_time, 0.0999)
AssertionError: 0.09599995613098145 not greater than or equal to 0.0999

ok

======================================================================
FAIL: test04_lock_timeout2 (bsddb.test.test_lock.LockingTestCase)
----------------------------------------------------------------------
Traceback (most recent call last):
  File "D:\buildarea\2.7.ware-win81-release.refleak\build\lib\bsddb\test\test_lock.py", line 132, in test04_lock_timeout2
    self.assertGreaterEqual(end_time-start_time, 0.0999)
AssertionError: 0.09599995613098145 not greater than or equal to 0.0999
History
Date User Action Args
2017-07-17 08:57:11hayposetrecipients: + haypo, paul.moore, tim.golden, zach.ware, serhiy.storchaka, steve.dower
2017-07-17 08:57:11hayposetmessageid: <1500281831.2.0.234205489392.issue30850@psf.upfronthosting.co.za>
2017-07-17 08:57:11haypolinkissue30850 messages
2017-07-17 08:57:11haypocreate