classification
Title: test_asyncore is failing
Type: behavior Stage:
Components: Tests Versions: Python 2.6
process
Status: closed Resolution: fixed
Dependencies: Superseder:
Assigned To: josiahcarlson Nosy List: benjamin.peterson, josiahcarlson
Priority: critical Keywords:

Created on 2008-06-10 13:06 by benjamin.peterson, last changed 2008-06-10 16:01 by josiahcarlson. This issue is now closed.

Messages (2)
msg67904 - (view) Author: Benjamin Peterson (benjamin.peterson) * (Python committer) Date: 2008-06-10 13:06
test_asyncore
test_closeall (test.test_asyncore.HelperFunctionTests) ... ok
test_closeall_default (test.test_asyncore.HelperFunctionTests) ... ok
test_compact_traceback (test.test_asyncore.HelperFunctionTests) ... ok
test_readwrite (test.test_asyncore.HelperFunctionTests) ... ok
test_readwriteexc (test.test_asyncore.HelperFunctionTests) ... ok
test_basic (test.test_asyncore.DispatcherTests) ... ok
test_log (test.test_asyncore.DispatcherTests) ... ok
test_log_info (test.test_asyncore.DispatcherTests) ... ok
test_repr (test.test_asyncore.DispatcherTests) ... ok
test_unhandled (test.test_asyncore.DispatcherTests) ... ok
test_send (test.test_asyncore.DispatcherWithSendTests) ... ok
test_send (test.test_asyncore.DispatcherWithSendTests_UsePoll) ... ok
test_recv (test.test_asyncore.FileWrapperTest) ... FAIL
test_send (test.test_asyncore.FileWrapperTest) ... ok

======================================================================
FAIL: test_recv (test.test_asyncore.FileWrapperTest)
----------------------------------------------------------------------
Traceback (most recent call last):
  File "/temp/python/trunk/Lib/test/test_asyncore.py", line 387, in
test_recv
    self.assertEqual(w.fd, fd)
AssertionError: 7 != 5

----------------------------------------------------------------------
Ran 14 tests in 0.969s

FAILED (failures=1)
test test_asyncore failed -- Traceback (most recent call last):
  File "/temp/python/trunk/Lib/test/test_asyncore.py", line 387, in
test_recv
    self.assertEqual(w.fd, fd)
AssertionError: 7 != 5

1 test failed:
    test_asyncore
msg67908 - (view) Author: Josiah Carlson (josiahcarlson) * Date: 2008-06-10 16:01
Fixed in 64080.
History
Date User Action Args
2008-06-10 16:01:52josiahcarlsonsetstatus: open -> closed
resolution: fixed
messages: + msg67908
2008-06-10 13:06:06benjamin.petersoncreate